{"text_format":"1","workbook":"xlsx","n_sheets":16,"sheets":["Own Source Revenue tables","18 Own Source Rev - S&L","17 Own Source Rev - S&L","16 Own Source Rev - S&L","15 Own Source Rev - S&L","14 Own Source Rev - S&L","13 Own Source Rev - S&L","12 Own Source Rev - S&L","11 Own Source Rev - S&L","10 Own Source Rev - S&L","09 Own Source Rev - S&L","08 Own Source Rev - S&L","07 Own Source Rev - S&L","06 Own Source Rev - S&L","05 Own Source Rev - S&L","04 Own Source Rev - S&L"],"not_rendered":{"charts":0,"images":48,"macros":1,"external_links":0,"defined_names":16,"comments":0,"pivot_tables":0},"unopened":[],"bounds":{"document_bytes":16777216,"sheet_cells":100000,"rows_first":2000,"rows_last":500,"rows_between":2000,"halvings":0,"cell_chars":16384,"cell_head_chars":4096},"cells_cut":0,"cells_raw":0,"read":"whole","date_system":"1900"}

{"sheet":"Own Source Revenue tables","index":0,"n_rows":69,"n_cols":12,"rows_kept":69,"cut":false,"hidden":false,"merged":[[68,0,68,7],[4,1,4,5],[3,1,3,2],[3,3,3,5],[2,1,2,5],[67,1,67,5],[66,1,66,5],[65,1,65,5],[64,1,64,5],[63,1,63,5],[62,1,62,5],[61,1,61,5],[60,1,60,5],[1,1,1,5],[0,0,67,0],[0,2,0,5],[0,6,67,7],[58,1,59,1],[58,2,59,2],[58,3,59,3],[58,4,59,4],[58,5,59,5]]}
["This cell intentionally left blank","Select Year","This cell intentionally left blank",null,null,null,"This cell intentionally left blank",null,null,null,null,"Select Year"]
[null,"This cell intentionally left blank",null,null,null,null,null,null,null,null,null,2018]
[null,"Own Source Revenue - State and Local",null,null,null,null,null,null,null,null,null,2017]
[null,"FY",null,{"$f":"IF(B1=2018,'18 Own Source Rev - S&L'!D3,0)+IF(B1=2017,'17 Own Source Rev - S&L'!D3,0)+IF(B1=2016,'16 Own Source Rev - S&L'!D3,0)+IF(B1=2015,'15 Own Source Rev - S&L'!D3,0)+IF(B1=2014,'14 Own Source Rev - S&L'!D3,0)+IF(B1=2013,'13 Own Source Rev - S&L'!D3,0)+IF(B1=2012,'12 Own Source Rev - S&L'!D3,0)+IF(B1=2011,'11 Own Source Rev - S&L'!D3,0)+IF(B1=2010,'10 Own Source Rev - S&L'!D3,0)+IF(B1=2009,'09 Own Source Rev - S&L'!D3,0)+IF(B1=2008,'08 Own Source Rev - S&L'!D3,0)+IF(B1=2007,'07 Own Source Rev - S&L'!D3,0)+IF(B1=2006,'06 Own Source Rev - S&L'!D3,0)+IF(B1=2005,'05 Own Source Rev - S&L'!D3)+IF(B1=2004,'04 Own Source Rev - S&L'!D3,0)","v":0},null,null,null,null,null,null,null,2016]
[null,"This cell intentionally left blank",null,null,null,null,null,null,null,null,null,2015]
[null,"This cell intentionally left blank","Dollars Per Capita",null,"% of Income",null,null,null,null,null,null,2014]
[null,"State","Amount","Rank","Amount","Rank",null,null,null,null,null,2013]
[null,"Alabama",{"$f":"IF($B$1=2018,'18 Own Source Rev - S&L'!C7,0)+IF($B$1=2017,'17 Own Source Rev - S&L'!C7,0)+IF($B$1=2016,'16 Own Source Rev - S&L'!C7,0)+IF($B$1=2015,'15 Own Source Rev - S&L'!C7,0)+IF($B$1=2014,'14 Own Source Rev - S&L'!C7,0)+IF($B$1=2013,'13 Own Source Rev - S&L'!C7,0)+IF($B$1=2012,'12 Own Source Rev - S&L'!C7,0)+IF($B$1=2011,'11 Own Source Rev - S&L'!C7,0)+IF($B$1=2010,'10 Own Source Rev - S&L'!C7,0)+IF($B$1=2009,'09 Own Source Rev - S&L'!C7,0)+IF($B$1=2008,'08 Own Source Rev - S&L'!C7,0)+IF($B$1=2007,'07 Own Source Rev - S&L'!C7,0)+IF($B$1=2006,'06 Own Source Rev - S&L'!C7,0)+IF($B$1=2005,'05 Own Source Rev - S&L'!C7,0)+IF($B$1=2004,'04 Own Source Rev - S&L'!C7,0)","v":0},{"$f":"IF($B$1=2018,'18 Own Source Rev - S&L'!D7,0)+IF($B$1=2017,'17 Own Source Rev - S&L'!D7,0)+IF($B$1=2016,'16 Own Source Rev - S&L'!D7,0)+IF($B$1=2015,'15 Own Source Rev - S&L'!D7,0)+IF($B$1=2014,'14 Own Source Rev - S&L'!D7,0)+IF($B$1=2013,'13 Own Source Rev - S&L'!D7,0)+IF($B$1=2012,'12 Own Source Rev - S&L'!D7,0)+IF($B$1=2011,'11 Own Source Rev - S&L'!D7,0)+IF($B$1=2010,'10 Own Source Rev - S&L'!D7,0)+IF($B$1=2009,'09 Own Source Rev - S&L'!D7,0)+IF($B$1=2008,'08 Own Source Rev - S&L'!D7,0)+IF($B$1=2007,'07 Own Source Rev - S&L'!D7,0)+IF($B$1=2006,'06 Own Source Rev - S&L'!D7,0)+IF($B$1=2005,'05 Own Source Rev - S&L'!D7,0)+IF($B$1=2004,'04 Own Source Rev - S&L'!D7,0)","v":0},{"$f":"IF($B$1=2018,'18 Own Source Rev - S&L'!E7,0)+IF($B$1=2017,'17 Own Source Rev - S&L'!E7,0)+IF($B$1=2016,'16 Own Source Rev - S&L'!E7,0)+IF($B$1=2015,'15 Own Source Rev - S&L'!E7,0)+IF($B$1=2014,'14 Own Source Rev - S&L'!E7,0)+IF($B$1=2013,'13 Own Source Rev - S&L'!E7,0)+IF($B$1=2012,'12 Own Source Rev - S&L'!E7,0)+IF($B$1=2011,'11 Own Source Rev - S&L'!E7,0)+IF($B$1=2010,'10 Own Source Rev - S&L'!E7,0)+IF($B$1=2009,'09 Own Source Rev - S&L'!E7,0)+IF($B$1=2008,'08 Own Source Rev - S&L'!E7,0)+IF($B$1=2007,'07 Own Source Rev - S&L'!E7,0)+IF($B$1=2006,'06 Own Source Rev - S&L'!E7,0)+IF($B$1=2005,'05 Own Source Rev - S&L'!E7,0)+IF($B$1=2004,'04 Own Source Rev - S&L'!E7,0)","v":0},{"$f":"IF($B$1=2018,'18 Own Source Rev - S&L'!F7,0)+IF($B$1=2017,'17 Own Source Rev - S&L'!F7,0)+IF($B$1=2016,'16 Own Source Rev - S&L'!F7,0)+IF($B$1=2015,'15 Own Source Rev - S&L'!F7,0)+IF($B$1=2014,'14 Own Source Rev - S&L'!F7,0)+IF($B$1=2013,'13 Own Source Rev - S&L'!F7,0)+IF($B$1=2012,'12 Own Source Rev - S&L'!F7,0)+IF($B$1=2011,'11 Own Source Rev - S&L'!F7,0)+IF($B$1=2010,'10 Own Source Rev - S&L'!F7,0)+IF($B$1=2009,'09 Own Source Rev - S&L'!F7,0)+IF($B$1=2008,'08 Own Source Rev - S&L'!F7,0)+IF($B$1=2007,'07 Own Source Rev - S&L'!F7,0)+IF($B$1=2006,'06 Own Source Rev - S&L'!F7,0)+IF($B$1=2005,'05 Own Source Rev - S&L'!F7,0)+IF($B$1=2004,'04 Own Source Rev - S&L'!F7,0)","v":0},null,null,null,null,null,2012]
[null,"Alaska",{"$f":"IF($B$1=2018,'18 Own Source Rev - S&L'!C8,0)+IF($B$1=2017,'17 Own Source Rev - S&L'!C8,0)+IF($B$1=2016,'16 Own Source Rev - S&L'!C8,0)+IF($B$1=2015,'15 Own Source Rev - S&L'!C8,0)+IF($B$1=2014,'14 Own Source Rev - S&L'!C8,0)+IF($B$1=2013,'13 Own Source Rev - S&L'!C8,0)+IF($B$1=2012,'12 Own Source Rev - S&L'!C8,0)+IF($B$1=2011,'11 Own Source Rev - S&L'!C8,0)+IF($B$1=2010,'10 Own Source Rev - S&L'!C8,0)+IF($B$1=2009,'09 Own Source Rev - S&L'!C8,0)+IF($B$1=2008,'08 Own Source Rev - S&L'!C8,0)+IF($B$1=2007,'07 Own Source Rev - S&L'!C8,0)+IF($B$1=2006,'06 Own Source Rev - S&L'!C8,0)+IF($B$1=2005,'05 Own Source Rev - S&L'!C8,0)+IF($B$1=2004,'04 Own Source Rev - S&L'!C8,0)","v":0},{"$f":"IF($B$1=2018,'18 Own Source Rev - S&L'!D8,0)+IF($B$1=2017,'17 Own Source Rev - S&L'!D8,0)+IF($B$1=2016,'16 Own Source Rev - S&L'!D8,0)+IF($B$1=2015,'15 Own Source Rev - S&L'!D8,0)+IF($B$1=2014,'14 Own Source Rev - S&L'!D8,0)+IF($B$1=2013,'13 Own Source Rev - S&L'!D8,0)+IF($B$1=2012,'12 Own Source Rev - S&L'!D8,0)+IF($B$1=2011,'11 Own Source Rev - S&L'!D8,0)+IF($B$1=2010,'10 Own Source Rev - S&L'!D8,0)+IF($B$1=2009,'09 Own Source Rev - S&L'!D8,0)+IF($B$1=2008,'08 Own Source Rev - S&L'!D8,0)+IF($B$1=2007,'07 Own Source Rev - S&L'!D8,0)+IF($B$1=2006,'06 Own Source Rev - S&L'!D8,0)+IF($B$1=2005,'05 Own Source Rev - S&L'!D8,0)+IF($B$1=2004,'04 Own Source Rev - S&L'!D8,0)","v":0},{"$f":"IF($B$1=2018,'18 Own Source Rev - S&L'!E8,0)+IF($B$1=2017,'17 Own Source Rev - S&L'!E8,0)+IF($B$1=2016,'16 Own Source Rev - S&L'!E8,0)+IF($B$1=2015,'15 Own Source Rev - S&L'!E8,0)+IF($B$1=2014,'14 Own Source Rev - S&L'!E8,0)+IF($B$1=2013,'13 Own Source Rev - S&L'!E8,0)+IF($B$1=2012,'12 Own Source Rev - S&L'!E8,0)+IF($B$1=2011,'11 Own Source Rev - S&L'!E8,0)+IF($B$1=2010,'10 Own Source Rev - S&L'!E8,0)+IF($B$1=2009,'09 Own Source Rev - S&L'!E8,0)+IF($B$1=2008,'08 Own Source Rev - S&L'!E8,0)+IF($B$1=2007,'07 Own Source Rev - S&L'!E8,0)+IF($B$1=2006,'06 Own Source Rev - S&L'!E8,0)+IF($B$1=2005,'05 Own Source Rev - S&L'!E8,0)+IF($B$1=2004,'04 Own Source Rev - S&L'!E8,0)","v":0},{"$f":"IF($B$1=2018,'18 Own Source Rev - S&L'!F8,0)+IF($B$1=2017,'17 Own Source Rev - S&L'!F8,0)+IF($B$1=2016,'16 Own Source Rev - S&L'!F8,0)+IF($B$1=2015,'15 Own Source Rev - S&L'!F8,0)+IF($B$1=2014,'14 Own Source Rev - S&L'!F8,0)+IF($B$1=2013,'13 Own Source Rev - S&L'!F8,0)+IF($B$1=2012,'12 Own Source Rev - S&L'!F8,0)+IF($B$1=2011,'11 Own Source Rev - S&L'!F8,0)+IF($B$1=2010,'10 Own Source Rev - S&L'!F8,0)+IF($B$1=2009,'09 Own Source Rev - S&L'!F8,0)+IF($B$1=2008,'08 Own Source Rev - S&L'!F8,0)+IF($B$1=2007,'07 Own Source Rev - S&L'!F8,0)+IF($B$1=2006,'06 Own Source Rev - S&L'!F8,0)+IF($B$1=2005,'05 Own Source Rev - S&L'!F8,0)+IF($B$1=2004,'04 Own Source Rev - S&L'!F8,0)","v":0},null,null,null,null,null,2011]
[null,"Arizona",{"$f":"IF($B$1=2018,'18 Own Source Rev - S&L'!C9,0)+IF($B$1=2017,'17 Own Source Rev - S&L'!C9,0)+IF($B$1=2016,'16 Own Source Rev - S&L'!C9,0)+IF($B$1=2015,'15 Own Source Rev - S&L'!C9,0)+IF($B$1=2014,'14 Own Source Rev - S&L'!C9,0)+IF($B$1=2013,'13 Own Source Rev - S&L'!C9,0)+IF($B$1=2012,'12 Own Source Rev - S&L'!C9,0)+IF($B$1=2011,'11 Own Source Rev - S&L'!C9,0)+IF($B$1=2010,'10 Own Source Rev - S&L'!C9,0)+IF($B$1=2009,'09 Own Source Rev - S&L'!C9,0)+IF($B$1=2008,'08 Own Source Rev - S&L'!C9,0)+IF($B$1=2007,'07 Own Source Rev - S&L'!C9,0)+IF($B$1=2006,'06 Own Source Rev - S&L'!C9,0)+IF($B$1=2005,'05 Own Source Rev - S&L'!C9,0)+IF($B$1=2004,'04 Own Source Rev - S&L'!C9,0)","v":0},{"$f":"IF($B$1=2018,'18 Own Source Rev - S&L'!D9,0)+IF($B$1=2017,'17 Own Source Rev - S&L'!D9,0)+IF($B$1=2016,'16 Own Source Rev - S&L'!D9,0)+IF($B$1=2015,'15 Own Source Rev - S&L'!D9,0)+IF($B$1=2014,'14 Own Source Rev - S&L'!D9,0)+IF($B$1=2013,'13 Own Source Rev - S&L'!D9,0)+IF($B$1=2012,'12 Own Source Rev - S&L'!D9,0)+IF($B$1=2011,'11 Own Source Rev - S&L'!D9,0)+IF($B$1=2010,'10 Own Source Rev - S&L'!D9,0)+IF($B$1=2009,'09 Own Source Rev - S&L'!D9,0)+IF($B$1=2008,'08 Own Source Rev - S&L'!D9,0)+IF($B$1=2007,'07 Own Source Rev - S&L'!D9,0)+IF($B$1=2006,'06 Own Source Rev - S&L'!D9,0)+IF($B$1=2005,'05 Own Source Rev - S&L'!D9,0)+IF($B$1=2004,'04 Own Source Rev - S&L'!D9,0)","v":0},{"$f":"IF($B$1=2018,'18 Own Source Rev - S&L'!E9,0)+IF($B$1=2017,'17 Own Source Rev - S&L'!E9,0)+IF($B$1=2016,'16 Own Source Rev - S&L'!E9,0)+IF($B$1=2015,'15 Own Source Rev - S&L'!E9,0)+IF($B$1=2014,'14 Own Source Rev - S&L'!E9,0)+IF($B$1=2013,'13 Own Source Rev - S&L'!E9,0)+IF($B$1=2012,'12 Own Source Rev - S&L'!E9,0)+IF($B$1=2011,'11 Own Source Rev - S&L'!E9,0)+IF($B$1=2010,'10 Own Source Rev - S&L'!E9,0)+IF($B$1=2009,'09 Own Source Rev - S&L'!E9,0)+IF($B$1=2008,'08 Own Source Rev - S&L'!E9,0)+IF($B$1=2007,'07 Own Source Rev - S&L'!E9,0)+IF($B$1=2006,'06 Own Source Rev - S&L'!E9,0)+IF($B$1=2005,'05 Own Source Rev - S&L'!E9,0)+IF($B$1=2004,'04 Own Source Rev - S&L'!E9,0)","v":0},{"$f":"IF($B$1=2018,'18 Own Source Rev - S&L'!F9,0)+IF($B$1=2017,'17 Own Source Rev - S&L'!F9,0)+IF($B$1=2016,'16 Own Source Rev - S&L'!F9,0)+IF($B$1=2015,'15 Own Source Rev - S&L'!F9,0)+IF($B$1=2014,'14 Own Source Rev - S&L'!F9,0)+IF($B$1=2013,'13 Own Source Rev - S&L'!F9,0)+IF($B$1=2012,'12 Own Source Rev - S&L'!F9,0)+IF($B$1=2011,'11 Own Source Rev - S&L'!F9,0)+IF($B$1=2010,'10 Own Source Rev - S&L'!F9,0)+IF($B$1=2009,'09 Own Source Rev - S&L'!F9,0)+IF($B$1=2008,'08 Own Source Rev - S&L'!F9,0)+IF($B$1=2007,'07 Own Source Rev - S&L'!F9,0)+IF($B$1=2006,'06 Own Source Rev - S&L'!F9,0)+IF($B$1=2005,'05 Own Source Rev - S&L'!F9,0)+IF($B$1=2004,'04 Own Source Rev - S&L'!F9,0)","v":0},null,null,null,null,null,2010]
{"$rows_left_out":60}
{"sheet":"18 Own Source Rev - S&L","index":1,"n_rows":65,"n_cols":6,"rows_kept":65,"cut":false,"hidden":true,"merged":[]}
[]
[null,"Own Source Revenue - State and Local"]
[null,null,"FY",2018]
[]
[null,null,"Per Capita",null,"% of Income"]
[null,"State","Amount","Rank","Amount","Rank"]
[null,"Alabama",6210.828407173055,41,0.15178289178289178,23]
[null,"Alaska",10589.764656751988,4,0.18337201797693525,6]
[null,"Arizona",5360.7944035951823,50,0.1279057856886911,47]
[null,"Arkansas",5949.4636235174348,46,0.1432209297768379,32]
{"$rows_left_out":56}
{"sheet":"17 Own Source Rev - S&L","index":2,"n_rows":65,"n_cols":6,"rows_kept":65,"cut":false,"hidden":true,"merged":[]}
[]
[null,"Own Source Revenue - State and Local"]
[null,null,"FY",2017]
[]
[null,null,"Per Capita",null,"% of Income"]
[null,"State","Amount","Rank","Amount","Rank"]
[null,"Alabama",5960.6061028793602,42,0.15110569949641647,22]
[null,"Alaska",10961.295119643099,3,0.19422573876049212,1]
[null,"Arizona",5227.6627170213324,50,0.13002750359905552,46]
[null,"Arkansas",5810.2997156274942,44,0.14442214459511613,30]
{"$rows_left_out":56}
{"sheet":"16 Own Source Rev - S&L","index":3,"n_rows":65,"n_cols":6,"rows_kept":65,"cut":false,"hidden":true,"merged":[]}
[]
[null,"Own Source Revenue - State and Local"]
[null,null,"FY",2016]
[]
[null,null,"Per Capita",null,"% of Income"]
[null,"State","Amount","Rank","Amount","Rank"]
[null,"Alabama",5680.461154695673,41,0.14898256813064001,25]
[null,"Alaska",10331.636781460384,3,0.18371104292104048,4]
[null,"Arizona",5095.7818152079954,50,0.13095808990924568,43]
[null,"Arkansas",5680.4541852120619,42,0.14615166687915168,28]
{"$rows_left_out":56}
{"sheet":"15 Own Source Rev - S&L","index":4,"n_rows":65,"n_cols":6,"rows_kept":65,"cut":false,"hidden":true,"merged":[]}
[]
[null,"Own Source Revenue - State and Local"]
[null,null,"FY",2015]
[]
[null,null,"Per Capita",null,"% of Income"]
[null,"State","Amount","Rank","Amount","Rank"]
[null,"Alabama",5594.7127291707984,44,0.15194396025188253,23]
[null,"Alaska",10034.136472718057,5,0.18400909606013824,6]
[null,"Arizona",4889.6790508804279,51,0.1300795887340831,47]
[null,"Arkansas",5502.4331014717573,45,0.14530331303824989,32]
{"$rows_left_out":56}
{"sheet":"14 Own Source Rev - S&L","index":5,"n_rows":65,"n_cols":6,"rows_kept":65,"cut":false,"hidden":true,"merged":[]}
[]
[null,"Own Source Revenue - State and Local"]
[null,null,"FY",2014]
[]
[null,null,"Per Capita",null,"% of Income"]
[null,"State","Amount","Rank","Amount","Rank"]
[null,"Alabama",5298.5042577098593,45,0.14851442774608345,30]
[null,"Alaska",15166.351524694415,1,0.29468094932130789,1]
[null,"Arizona",4937.8892210155573,49,0.13701533953641645,42]
[null,"Arkansas",5331.6761670046162,44,0.14857873165332172,29]
{"$rows_left_out":56}
{"sheet":"13 Own Source Rev - S&L","index":6,"n_rows":65,"n_cols":6,"rows_kept":65,"cut":false,"hidden":true,"merged":[]}
[]
[null,"Own Source Revenue - State and Local"]
[null,null,"FY",2013]
[]
[null,null,"Per Capita",null,"% of Income"]
[null,"State","Amount","Rank","Amount","Rank"]
[null,"Alabama",5340.9658934117615,43,0.14861462920331145,30]
[null,"Alaska",16576.561953346838,1,0.31989768196479895,1]
[null,"Arizona",5001.3450867685779,48,0.13749580593792537,39]
[null,"Arkansas",5203.5381176940709,46,0.14380500648180253,35]
{"$rows_left_out":56}
{"sheet":"12 Own Source Rev - S&L","index":7,"n_rows":65,"n_cols":6,"rows_kept":65,"cut":false,"hidden":true,"merged":[]}
[]
[null,"Own Source Revenue - State and Local"]
[null,null,"FY",2012]
[]
[null,null,"Per Capita",null,"% of Income"]
[null,"State","Amount","Rank","Amount","Rank"]
[null,"Alabama",5114.1141702323193,44,0.14699999999999999,35]
[null,"Alaska",19159.913187131784,1,0.40200000000000002,1]
[null,"Arizona",4892.6288922982176,48,0.14000000000000001,41]
[null,"Arkansas",5050.4546704372506,47,0.14899999999999999,28]
{"$rows_left_out":56}
{"sheet":"11 Own Source Rev - S&L","index":8,"n_rows":65,"n_cols":6,"rows_kept":65,"cut":false,"hidden":true,"merged":[]}
[]
[null,"Own Source Revenue - State and Local"]
[null,null,"FY",2011]
[]
[null,null,"Per Capita",null,"% of Income"]
[null,"State","Amount","Rank","Amount","Rank"]
[null,"Alabama",5200.87,41,0.154,33]
[null,"Alaska",17211.830000000002,1,0.38200000000000001,1]
[null,"Arizona",4791.43,50,0.14199999999999999,43]
[null,"Arkansas",5043.3999999999996,45,0.158,27]
{"$rows_left_out":56}
{"sheet":"10 Own Source Rev - S&L","index":9,"n_rows":65,"n_cols":6,"rows_kept":65,"cut":false,"hidden":true,"merged":[]}
[]
[null,"Own Source Revenue - State and Local"]
[null,null,"FY",2010]
[]
[null,null,"Per Capita",null,"% of Income"]
[null,"State","Amount","Rank","Amount","Rank"]
[null,"Alabama",5037.47,41,0.154,30]
[null,"Alaska",15073.22,1,0.34799999999999998,1]
[null,"Arizona",4547.2,50,0.13500000000000001,46]
[null,"Arkansas",4766.5,47,0.152,33]
{"$rows_left_out":56}
{"sheet":"09 Own Source Rev - S&L","index":10,"n_rows":65,"n_cols":6,"rows_kept":65,"cut":false,"hidden":true,"merged":[]}
[]
[null,"Own Source Revenue - State and Local"]
[null,null,"FY",2009]
[]
[null,null,"Per Capita",null,"% of Income"]
[null,"State","Amount","Rank","Amount","Rank"]
[null,"Alabama",5088.22,42,0.151,28]
[null,"Alaska",16783.23,1,0.378,1]
[null,"Arizona",4548.91,51,0.13400000000000001,45]
[null,"Arkansas",4778.59,48,0.14799999999999999,33]
{"$rows_left_out":56}
{"sheet":"08 Own Source Rev - S&L","index":11,"n_rows":65,"n_cols":6,"rows_kept":65,"cut":false,"hidden":true,"merged":[]}
[]
[null,"Own Source Revenue - State and Local"]
[null,null,"FY",2008]
[]
[null,null,"Per Capita",null,"% of Income"]
[null,"State","Amount","Rank","Amount","Rank"]
[null,"Alabama",5195.6499999999996,42,0.159,30]
[null,"Alaska",23566.55,1,0.56999999999999995,1]
[null,"Arizona",5011.7299999999996,46,0.14699999999999999,43]
[null,"Arkansas",4753.99,51,0.153,36]
{"$rows_left_out":56}
{"sheet":"07 Own Source Rev - S&L","index":12,"n_rows":65,"n_cols":6,"rows_kept":65,"cut":false,"hidden":true,"merged":[]}
[]
[null,"Own Source Revenue - State and Local"]
[null,null,"FY",2007]
[]
[null,null,"Per Capita",null,"% of Income"]
[null,"State","Amount","Rank","Amount","Rank"]
[null,"Alabama",5102.42,41,0.16200000000000001,29]
[null,"Alaska",15290.91,1,0.39400000000000002,1]
[null,"Arizona",5101.99,42,0.155,37]
[null,"Arkansas",4625.17,51,0.158,32]
{"$rows_left_out":56}
{"sheet":"06 Own Source Rev - S&L","index":13,"n_rows":65,"n_cols":6,"rows_kept":65,"cut":false,"hidden":true,"merged":[]}
[]
[null,"Own Source Revenue - State and Local"]
[null,null,"FY",2006]
[]
[null,null,"Per Capita",null,"% of Income"]
[null,"State","Amount","Rank","Amount","Rank"]
[null,"Alabama",4761.16,43,0.159,33]
[null,"Alaska",12722.15,1,0.34499999999999997,1]
[null,"Arizona",4687.22,45,0.153,39]
[null,"Arkansas",4501.34,48,0.16300000000000001,26]
{"$rows_left_out":56}
{"sheet":"05 Own Source Rev - S&L","index":14,"n_rows":65,"n_cols":6,"rows_kept":65,"cut":false,"hidden":true,"merged":[]}
[]
[null,"Own Source Revenue - State and Local"]
[null,null,"FY",2005]
[]
[null,null,"Per Capita",null,"% of Income"]
[null,"State","Amount","Rank","Amount","Rank"]
[null,"Alabama",4418.79,42,0.154,31]
[null,"Alaska",10861.33,1,0.308,1]
[null,"Arizona",4237.88,47,0.14799999999999999,39]
[null,"Arkansas",4208.68,49,0.158,27]
{"$rows_left_out":56}
{"sheet":"04 Own Source Rev - S&L","index":15,"n_rows":65,"n_cols":6,"rows_kept":65,"cut":false,"hidden":true,"merged":[]}
[]
[null,"Own Source Revenue - State and Local"]
[null,null,"FY",2004]
[]
[null,null,"Per Capita",null,"% of Income"]
[null,"State","Amount","Rank","Amount","Rank"]
[null,"Alabama",4143.45,42,0.153,29]
[null,"Alaska",9223.44,1,0.27,1]
[null,"Arizona",3925.32,47,0.14399999999999999,40]
[null,"Arkansas",3811.76,51,0.151,33]
{"$rows_left_out":55}