{"text_format":"1","workbook":"xlsx","n_sheets":20,"sheets":["22 Total Revenue - S&L","Total Revenue tables","21 Total Revenue - S&L","20 Total Revenue - S&L","19 Total Revenue - S&L","18 Total Revenue - S&L","17 Total Revenue - S&L","16 Total Revenue - S&L","15 Total Revenue - S&L","14 Total Revenue - S&L","13 Total Revenue - S&L","12 Total Revenue - S&L","11 Total Revenue - S&L","10 Total Revenue - S&L","09 Total Revenue - S&L","08 Total Revenue - S&L","07 Total Revenue - S&L","06 Total Revenue - S&L","05 Total Revenue - S&L","04 Total Revenue - S&L"],"not_rendered":{"charts":0,"images":57,"macros":1,"external_links":1,"defined_names":19,"comments":0,"pivot_tables":0},"unopened":[],"bounds":{"document_bytes":16777216,"sheet_cells":100000,"rows_first":2000,"rows_last":500,"rows_between":2000,"halvings":0,"cell_chars":16384,"cell_head_chars":4096},"cells_cut":0,"cells_raw":0,"read":"whole","date_system":"1900"}

{"sheet":"22 Total Revenue - S&L","index":0,"n_rows":66,"n_cols":6,"rows_kept":66,"cut":false,"hidden":true,"merged":[]}
[]
[null,"Total Revenue Tax - State and Local"]
[null,null,"FY",2022]
[]
[null,null,"Per Capita",null,"% of Income"]
[null,"State","Amount","Rank","Amount","Rank"]
[null,"Alabama",13736.22182821119,34,0.26588668985188912,13]
[null,"Alaska",23120.580381471391,3,0.33533910328610667,2]
[null,"Arizona",13000.628896719978,42,0.22083819320853065,35]
[null,"Arkansas",13683.510498687665,37,0.24746990239416145,20]
{"$rows_left_out":57}
{"sheet":"Total Revenue tables","index":1,"n_rows":69,"n_cols":12,"rows_kept":69,"cut":false,"hidden":false,"merged":[[58,4,59,4],[61,1,62,5],[63,1,65,5],[3,1,4,2],[3,3,4,5],[0,6,67,7],[0,2,0,5],[1,1,1,5],[68,0,68,7],[2,1,2,5],[5,2,5,3],[5,4,5,5],[60,1,60,5],[66,1,66,5],[67,1,67,5],[58,5,59,5],[0,0,67,0],[58,1,59,1],[58,2,59,2],[58,3,59,3]]}
["This cell intentionally left blank","Select Year","This cell intentionally left blank",null,null,null,"This cell intentionally left blank",null,null,null,null,"Select Year"]
[null,"This cell intentionally left blank",null,null,null,null,null,null,null,null,null,2022]
[null,"Total Revenue - State and Local",null,null,null,null,null,null,null,null,null,2021]
[null,"FY",null,{"$f":"IF(B1=2022,'22 Total Revenue - S&L'!D3,0)+IF(B1=2021,'21 Total Revenue - S&L'!D3,0)+IF(B1=2020,'20 Total Revenue - S&L'!D3,0)+IF(B1=2019,'19 Total Revenue - S&L'!D3,0)+IF(B1=2018,'18 Total Revenue - S&L'!D3,0)+IF(B1=2017,'17 Total Revenue - S&L'!D3,0)+IF(B1=2016,'16 Total Revenue - S&L'!D3,0)+IF(B1=2015,'15 Total Revenue - S&L'!D3,0)+IF(B1=2014,'14 Total Revenue - S&L'!D3,0)+IF(B1=2013,'13 Total Revenue - S&L'!D3,0)+IF(B1=2012,'12 Total Revenue - S&L'!D3,0)+IF(B1=2011,'11 Total Revenue - S&L'!D3,0)+IF(B1=2010,'10 Total Revenue - S&L'!D3,0)+IF(B1=2009,'09 Total Revenue - S&L'!D3,0)+IF(B1=2008,'08 Total Revenue - S&L'!D3,0)+IF(B1=2007,'07 Total Revenue - S&L'!D3,0)+IF(B1=2006,'06 Total Revenue - S&L'!D3,0)+IF(B1=2005,'05 Total Revenue - S&L'!D3)+IF(B1=2004,'04 Total Revenue - S&L'!D3,0)","v":0},null,null,null,null,null,null,null,2020]
[null,null,null,null,null,null,null,null,null,null,null,2019]
[null,"This cell intentionally left blank","Dollars Per Capita",null,"% of Income",null,null,null,null,null,null,2018]
[null,"State","Amount","Rank","Amount","Rank",null,null,null,null,null,2017]
[null,"Alabama",{"$f":"IF($B$1=2022,'22 Total Revenue - S&L'!C7,0)+IF($B$1=2021,'21 Total Revenue - S&L'!C7,0)+IF($B$1=2020,'20 Total Revenue - S&L'!C7,0)+IF($B$1=2019,'19 Total Revenue - S&L'!C7,0)+IF($B$1=2018,'18 Total Revenue - S&L'!C7,0)+IF($B$1=2017,'17 Total Revenue - S&L'!C7,0)+IF($B$1=2016,'16 Total Revenue - S&L'!C7,0)+IF($B$1=2015,'15 Total Revenue - S&L'!C7,0)+IF($B$1=2014,'14 Total Revenue - S&L'!C7,0)+IF($B$1=2013,'13 Total Revenue - S&L'!C7,0)+IF($B$1=2012,'12 Total Revenue - S&L'!C7,0)+IF($B$1=2011,'11 Total Revenue - S&L'!C7,0)+IF($B$1=2010,'10 Total Revenue - S&L'!C7,0)+IF($B$1=2009,'09 Total Revenue - S&L'!C7,0)+IF($B$1=2008,'08 Total Revenue - S&L'!C7,0)+IF($B$1=2007,'07 Total Revenue - S&L'!C7,0)+IF($B$1=2006,'06 Total Revenue - S&L'!C7,0)+IF($B$1=2005,'05 Total Revenue - S&L'!C7,0)+IF($B$1=2004,'04 Total Revenue - S&L'!C7,0)","v":0},{"$f":"IF($B$1=2022,'22 Total Revenue - S&L'!D7,0)+IF($B$1=2021,'21 Total Revenue - S&L'!D7,0)+IF($B$1=2020,'20 Total Revenue - S&L'!D7,0)+IF($B$1=2019,'19 Total Revenue - S&L'!D7,0)+IF($B$1=2018,'18 Total Revenue - S&L'!D7,0)+IF($B$1=2017,'17 Total Revenue - S&L'!D7,0)+IF($B$1=2016,'16 Total Revenue - S&L'!D7,0)+IF($B$1=2015,'15 Total Revenue - S&L'!D7,0)+IF($B$1=2014,'14 Total Revenue - S&L'!D7,0)+IF($B$1=2013,'13 Total Revenue - S&L'!D7,0)+IF($B$1=2012,'12 Total Revenue - S&L'!D7,0)+IF($B$1=2011,'11 Total Revenue - S&L'!D7,0)+IF($B$1=2010,'10 Total Revenue - S&L'!D7,0)+IF($B$1=2009,'09 Total Revenue - S&L'!D7,0)+IF($B$1=2008,'08 Total Revenue - S&L'!D7,0)+IF($B$1=2007,'07 Total Revenue - S&L'!D7,0)+IF($B$1=2006,'06 Total Revenue - S&L'!D7,0)+IF($B$1=2005,'05 Total Revenue - S&L'!D7,0)+IF($B$1=2004,'04 Total Revenue - S&L'!D7,0)","v":0},{"$f":"IF($B$1=2022,'22 Total Revenue - S&L'!E7,0)+IF($B$1=2021,'21 Total Revenue - S&L'!E7,0)+IF($B$1=2020,'20 Total Revenue - S&L'!E7,0)+IF($B$1=2019,'19 Total Revenue - S&L'!E7,0)+IF($B$1=2018,'18 Total Revenue - S&L'!E7,0)+IF($B$1=2017,'17 Total Revenue - S&L'!E7,0)+IF($B$1=2016,'16 Total Revenue - S&L'!E7,0)+IF($B$1=2015,'15 Total Revenue - S&L'!E7,0)+IF($B$1=2014,'14 Total Revenue - S&L'!E7,0)+IF($B$1=2013,'13 Total Revenue - S&L'!E7,0)+IF($B$1=2012,'12 Total Revenue - S&L'!E7,0)+IF($B$1=2011,'11 Total Revenue - S&L'!E7,0)+IF($B$1=2010,'10 Total Revenue - S&L'!E7,0)+IF($B$1=2009,'09 Total Revenue - S&L'!E7,0)+IF($B$1=2008,'08 Total Revenue - S&L'!E7,0)+IF($B$1=2007,'07 Total Revenue - S&L'!E7,0)+IF($B$1=2006,'06 Total Revenue - S&L'!E7,0)+IF($B$1=2005,'05 Total Revenue - S&L'!E7,0)+IF($B$1=2004,'04 Total Revenue - S&L'!E7,0)","v":0},{"$f":"IF($B$1=2022,'22 Total Revenue - S&L'!F7,0)+IF($B$1=2021,'21 Total Revenue - S&L'!F7,0)+IF($B$1=2020,'20 Total Revenue - S&L'!F7,0)+IF($B$1=2019,'19 Total Revenue - S&L'!F7,0)+IF($B$1=2018,'18 Total Revenue - S&L'!F7,0)+IF($B$1=2017,'17 Total Revenue - S&L'!F7,0)+IF($B$1=2016,'16 Total Revenue - S&L'!F7,0)+IF($B$1=2015,'15 Total Revenue - S&L'!F7,0)+IF($B$1=2014,'14 Total Revenue - S&L'!F7,0)+IF($B$1=2013,'13 Total Revenue - S&L'!F7,0)+IF($B$1=2012,'12 Total Revenue - S&L'!F7,0)+IF($B$1=2011,'11 Total Revenue - S&L'!F7,0)+IF($B$1=2010,'10 Total Revenue - S&L'!F7,0)+IF($B$1=2009,'09 Total Revenue - S&L'!F7,0)+IF($B$1=2008,'08 Total Revenue - S&L'!F7,0)+IF($B$1=2007,'07 Total Revenue - S&L'!F7,0)+IF($B$1=2006,'06 Total Revenue - S&L'!F7,0)+IF($B$1=2005,'05 Total Revenue - S&L'!F7,0)+IF($B$1=2004,'04 Total Revenue - S&L'!F7,0)","v":0},null,null,null,null,null,2016]
[null,"Alaska",{"$f":"IF($B$1=2022,'22 Total Revenue - S&L'!C8,0)+IF($B$1=2021,'21 Total Revenue - S&L'!C8,0)+IF($B$1=2020,'20 Total Revenue - S&L'!C8,0)+IF($B$1=2019,'19 Total Revenue - S&L'!C8,0)+IF($B$1=2018,'18 Total Revenue - S&L'!C8,0)+IF($B$1=2017,'17 Total Revenue - S&L'!C8,0)+IF($B$1=2016,'16 Total Revenue - S&L'!C8,0)+IF($B$1=2015,'15 Total Revenue - S&L'!C8,0)+IF($B$1=2014,'14 Total Revenue - S&L'!C8,0)+IF($B$1=2013,'13 Total Revenue - S&L'!C8,0)+IF($B$1=2012,'12 Total Revenue - S&L'!C8,0)+IF($B$1=2011,'11 Total Revenue - S&L'!C8,0)+IF($B$1=2010,'10 Total Revenue - S&L'!C8,0)+IF($B$1=2009,'09 Total Revenue - S&L'!C8,0)+IF($B$1=2008,'08 Total Revenue - S&L'!C8,0)+IF($B$1=2007,'07 Total Revenue - S&L'!C8,0)+IF($B$1=2006,'06 Total Revenue - S&L'!C8,0)+IF($B$1=2005,'05 Total Revenue - S&L'!C8,0)+IF($B$1=2004,'04 Total Revenue - S&L'!C8,0)","v":0},{"$f":"IF($B$1=2022,'22 Total Revenue - S&L'!D8,0)+IF($B$1=2021,'21 Total Revenue - S&L'!D8,0)+IF($B$1=2020,'20 Total Revenue - S&L'!D8,0)+IF($B$1=2019,'19 Total Revenue - S&L'!D8,0)+IF($B$1=2018,'18 Total Revenue - S&L'!D8,0)+IF($B$1=2017,'17 Total Revenue - S&L'!D8,0)+IF($B$1=2016,'16 Total Revenue - S&L'!D8,0)+IF($B$1=2015,'15 Total Revenue - S&L'!D8,0)+IF($B$1=2014,'14 Total Revenue - S&L'!D8,0)+IF($B$1=2013,'13 Total Revenue - S&L'!D8,0)+IF($B$1=2012,'12 Total Revenue - S&L'!D8,0)+IF($B$1=2011,'11 Total Revenue - S&L'!D8,0)+IF($B$1=2010,'10 Total Revenue - S&L'!D8,0)+IF($B$1=2009,'09 Total Revenue - S&L'!D8,0)+IF($B$1=2008,'08 Total Revenue - S&L'!D8,0)+IF($B$1=2007,'07 Total Revenue - S&L'!D8,0)+IF($B$1=2006,'06 Total Revenue - S&L'!D8,0)+IF($B$1=2005,'05 Total Revenue - S&L'!D8,0)+IF($B$1=2004,'04 Total Revenue - S&L'!D8,0)","v":0},{"$f":"IF($B$1=2022,'22 Total Revenue - S&L'!E8,0)+IF($B$1=2021,'21 Total Revenue - S&L'!E8,0)+IF($B$1=2020,'20 Total Revenue - S&L'!E8,0)+IF($B$1=2019,'19 Total Revenue - S&L'!E8,0)+IF($B$1=2018,'18 Total Revenue - S&L'!E8,0)+IF($B$1=2017,'17 Total Revenue - S&L'!E8,0)+IF($B$1=2016,'16 Total Revenue - S&L'!E8,0)+IF($B$1=2015,'15 Total Revenue - S&L'!E8,0)+IF($B$1=2014,'14 Total Revenue - S&L'!E8,0)+IF($B$1=2013,'13 Total Revenue - S&L'!E8,0)+IF($B$1=2012,'12 Total Revenue - S&L'!E8,0)+IF($B$1=2011,'11 Total Revenue - S&L'!E8,0)+IF($B$1=2010,'10 Total Revenue - S&L'!E8,0)+IF($B$1=2009,'09 Total Revenue - S&L'!E8,0)+IF($B$1=2008,'08 Total Revenue - S&L'!E8,0)+IF($B$1=2007,'07 Total Revenue - S&L'!E8,0)+IF($B$1=2006,'06 Total Revenue - S&L'!E8,0)+IF($B$1=2005,'05 Total Revenue - S&L'!E8,0)+IF($B$1=2004,'04 Total Revenue - S&L'!E8,0)","v":0},{"$f":"IF($B$1=2022,'22 Total Revenue - S&L'!F8,0)+IF($B$1=2021,'21 Total Revenue - S&L'!F8,0)+IF($B$1=2020,'20 Total Revenue - S&L'!F8,0)+IF($B$1=2019,'19 Total Revenue - S&L'!F8,0)+IF($B$1=2018,'18 Total Revenue - S&L'!F8,0)+IF($B$1=2017,'17 Total Revenue - S&L'!F8,0)+IF($B$1=2016,'16 Total Revenue - S&L'!F8,0)+IF($B$1=2015,'15 Total Revenue - S&L'!F8,0)+IF($B$1=2014,'14 Total Revenue - S&L'!F8,0)+IF($B$1=2013,'13 Total Revenue - S&L'!F8,0)+IF($B$1=2012,'12 Total Revenue - S&L'!F8,0)+IF($B$1=2011,'11 Total Revenue - S&L'!F8,0)+IF($B$1=2010,'10 Total Revenue - S&L'!F8,0)+IF($B$1=2009,'09 Total Revenue - S&L'!F8,0)+IF($B$1=2008,'08 Total Revenue - S&L'!F8,0)+IF($B$1=2007,'07 Total Revenue - S&L'!F8,0)+IF($B$1=2006,'06 Total Revenue - S&L'!F8,0)+IF($B$1=2005,'05 Total Revenue - S&L'!F8,0)+IF($B$1=2004,'04 Total Revenue - S&L'!F8,0)","v":0},null,null,null,null,null,2015]
[null,"Arizona",{"$f":"IF($B$1=2022,'22 Total Revenue - S&L'!C9,0)+IF($B$1=2021,'21 Total Revenue - S&L'!C9,0)+IF($B$1=2020,'20 Total Revenue - S&L'!C9,0)+IF($B$1=2019,'19 Total Revenue - S&L'!C9,0)+IF($B$1=2018,'18 Total Revenue - S&L'!C9,0)+IF($B$1=2017,'17 Total Revenue - S&L'!C9,0)+IF($B$1=2016,'16 Total Revenue - S&L'!C9,0)+IF($B$1=2015,'15 Total Revenue - S&L'!C9,0)+IF($B$1=2014,'14 Total Revenue - S&L'!C9,0)+IF($B$1=2013,'13 Total Revenue - S&L'!C9,0)+IF($B$1=2012,'12 Total Revenue - S&L'!C9,0)+IF($B$1=2011,'11 Total Revenue - S&L'!C9,0)+IF($B$1=2010,'10 Total Revenue - S&L'!C9,0)+IF($B$1=2009,'09 Total Revenue - S&L'!C9,0)+IF($B$1=2008,'08 Total Revenue - S&L'!C9,0)+IF($B$1=2007,'07 Total Revenue - S&L'!C9,0)+IF($B$1=2006,'06 Total Revenue - S&L'!C9,0)+IF($B$1=2005,'05 Total Revenue - S&L'!C9,0)+IF($B$1=2004,'04 Total Revenue - S&L'!C9,0)","v":0},{"$f":"IF($B$1=2022,'22 Total Revenue - S&L'!D9,0)+IF($B$1=2021,'21 Total Revenue - S&L'!D9,0)+IF($B$1=2020,'20 Total Revenue - S&L'!D9,0)+IF($B$1=2019,'19 Total Revenue - S&L'!D9,0)+IF($B$1=2018,'18 Total Revenue - S&L'!D9,0)+IF($B$1=2017,'17 Total Revenue - S&L'!D9,0)+IF($B$1=2016,'16 Total Revenue - S&L'!D9,0)+IF($B$1=2015,'15 Total Revenue - S&L'!D9,0)+IF($B$1=2014,'14 Total Revenue - S&L'!D9,0)+IF($B$1=2013,'13 Total Revenue - S&L'!D9,0)+IF($B$1=2012,'12 Total Revenue - S&L'!D9,0)+IF($B$1=2011,'11 Total Revenue - S&L'!D9,0)+IF($B$1=2010,'10 Total Revenue - S&L'!D9,0)+IF($B$1=2009,'09 Total Revenue - S&L'!D9,0)+IF($B$1=2008,'08 Total Revenue - S&L'!D9,0)+IF($B$1=2007,'07 Total Revenue - S&L'!D9,0)+IF($B$1=2006,'06 Total Revenue - S&L'!D9,0)+IF($B$1=2005,'05 Total Revenue - S&L'!D9,0)+IF($B$1=2004,'04 Total Revenue - S&L'!D9,0)","v":0},{"$f":"IF($B$1=2022,'22 Total Revenue - S&L'!E9,0)+IF($B$1=2021,'21 Total Revenue - S&L'!E9,0)+IF($B$1=2020,'20 Total Revenue - S&L'!E9,0)+IF($B$1=2019,'19 Total Revenue - S&L'!E9,0)+IF($B$1=2018,'18 Total Revenue - S&L'!E9,0)+IF($B$1=2017,'17 Total Revenue - S&L'!E9,0)+IF($B$1=2016,'16 Total Revenue - S&L'!E9,0)+IF($B$1=2015,'15 Total Revenue - S&L'!E9,0)+IF($B$1=2014,'14 Total Revenue - S&L'!E9,0)+IF($B$1=2013,'13 Total Revenue - S&L'!E9,0)+IF($B$1=2012,'12 Total Revenue - S&L'!E9,0)+IF($B$1=2011,'11 Total Revenue - S&L'!E9,0)+IF($B$1=2010,'10 Total Revenue - S&L'!E9,0)+IF($B$1=2009,'09 Total Revenue - S&L'!E9,0)+IF($B$1=2008,'08 Total Revenue - S&L'!E9,0)+IF($B$1=2007,'07 Total Revenue - S&L'!E9,0)+IF($B$1=2006,'06 Total Revenue - S&L'!E9,0)+IF($B$1=2005,'05 Total Revenue - S&L'!E9,0)+IF($B$1=2004,'04 Total Revenue - S&L'!E9,0)","v":0},{"$f":"IF($B$1=2022,'22 Total Revenue - S&L'!F9,0)+IF($B$1=2021,'21 Total Revenue - S&L'!F9,0)+IF($B$1=2020,'20 Total Revenue - S&L'!F9,0)+IF($B$1=2019,'19 Total Revenue - S&L'!F9,0)+IF($B$1=2018,'18 Total Revenue - S&L'!F9,0)+IF($B$1=2017,'17 Total Revenue - S&L'!F9,0)+IF($B$1=2016,'16 Total Revenue - S&L'!F9,0)+IF($B$1=2015,'15 Total Revenue - S&L'!F9,0)+IF($B$1=2014,'14 Total Revenue - S&L'!F9,0)+IF($B$1=2013,'13 Total Revenue - S&L'!F9,0)+IF($B$1=2012,'12 Total Revenue - S&L'!F9,0)+IF($B$1=2011,'11 Total Revenue - S&L'!F9,0)+IF($B$1=2010,'10 Total Revenue - S&L'!F9,0)+IF($B$1=2009,'09 Total Revenue - S&L'!F9,0)+IF($B$1=2008,'08 Total Revenue - S&L'!F9,0)+IF($B$1=2007,'07 Total Revenue - S&L'!F9,0)+IF($B$1=2006,'06 Total Revenue - S&L'!F9,0)+IF($B$1=2005,'05 Total Revenue - S&L'!F9,0)+IF($B$1=2004,'04 Total Revenue - S&L'!F9,0)","v":0},null,null,null,null,null,2014]
{"$rows_left_out":60}
{"sheet":"21 Total Revenue - S&L","index":2,"n_rows":65,"n_cols":6,"rows_kept":65,"cut":false,"hidden":true,"merged":[]}
[]
[null,"Total Revenue - State and Local"]
[null,null,"FY",2021]
[]
[null,null,"Per Capita",null,"% of Income"]
[null,"State","Amount","Rank","Amount","Rank"]
[null,"Alabama",10796.925886452776,36,0.23615973918082961,14]
[null,"Alaska",18838.843774431953,2,0.30487696814595855,2]
[null,"Arizona",10030.39308167227,42,0.19467612829731792,34]
[null,"Arkansas",10513.316834658577,39,0.22401819132414852,22]
{"$rows_left_out":56}
{"sheet":"20 Total Revenue - S&L","index":3,"n_rows":65,"n_cols":6,"rows_kept":65,"cut":false,"hidden":true,"merged":[]}
[]
[null,"Total Revenue - State and Local"]
[null,null,"FY",2020]
[]
[null,null,"Per Capita",null,"% of Income"]
[null,"State","Amount","Rank","Amount","Rank"]
[null,"Alabama",9774.4334487716424,38,0.22224721296933689,16]
[null,"Alaska",16979.479127630417,4,0.27020687733838866,4]
[null,"Arizona",8500.2325032699355,49,0.18817280355658328,35]
[null,"Arkansas",9446.3132094074881,41,0.21255335688993462,20]
{"$rows_left_out":56}
{"sheet":"19 Total Revenue - S&L","index":4,"n_rows":65,"n_cols":6,"rows_kept":65,"cut":false,"hidden":true,"merged":[]}
[]
[null,"Total Revenue - State and Local"]
[null,null,"FY",2019]
[]
[null,null,"Per Capita",null,"% of Income"]
[null,"State","Amount","Rank","Amount","Rank"]
[null,"Alabama",9070.799286586167,36,0.21305500240236414,15]
[null,"Alaska",16572.661968846758,2,0.27324221989830877,2]
[null,"Arizona",8036.3568194779382,47,0.18323793183706982,34]
[null,"Arkansas",8965.0540591768058,38,0.20747925382005022,20]
{"$rows_left_out":56}
{"sheet":"18 Total Revenue - S&L","index":5,"n_rows":65,"n_cols":6,"rows_kept":65,"cut":false,"hidden":true,"merged":[]}
[]
[null,"Total Revenue - State and Local"]
[null,null,"FY",2018]
[]
[null,null,"Per Capita",null,"% of Income"]
[null,"State","Amount","Rank","Amount","Rank"]
[null,"Alabama",8507.9631833583262,40,0.20792125792125793,20]
[null,"Alaska",15629.695880642981,3,0.27064330198989972,1]
[null,"Arizona",7661.6131770443908,48,0.18280213328000133,34]
[null,"Arkansas",8652.4269760806019,38,0.20828913575368904,19]
{"$rows_left_out":56}
{"sheet":"17 Total Revenue - S&L","index":6,"n_rows":65,"n_cols":6,"rows_kept":65,"cut":false,"hidden":true,"merged":[]}
[]
[null,"Total Revenue - State and Local"]
[null,null,"FY",2017]
[]
[null,null,"Per Capita",null,"% of Income"]
[null,"State","Amount","Rank","Amount","Rank"]
[null,"Alabama",8210.9939386429669,41,0.20815466770403249,19]
[null,"Alaska",15716.928484520751,2,0.27849191292016406,1]
[null,"Arizona",7473.8944078428076,47,0.18589795949354396,33]
[null,"Arkansas",8525.7282984795147,36,0.2119174612954893,16]
{"$rows_left_out":56}
{"sheet":"16 Total Revenue - S&L","index":7,"n_rows":65,"n_cols":6,"rows_kept":65,"cut":false,"hidden":true,"merged":[]}
[]
[null,"Total Revenue - State and Local"]
[null,null,"FY",2016]
[]
[null,null,"Per Capita",null,"% of Income"]
[null,"State","Amount","Rank","Amount","Rank"]
[null,"Alabama",7820.2641659532001,40,0.20311407377192719,20]
[null,"Alaska",14551.183810201968,3,0.25513137546995818,3]
[null,"Arizona",7254.3604073572169,47,0.18605452523885116,30]
[null,"Arkansas",8246.6130062432912,35,0.21213807306066479,15]
{"$rows_left_out":56}
{"sheet":"15 Total Revenue - S&L","index":8,"n_rows":65,"n_cols":6,"rows_kept":65,"cut":false,"hidden":true,"merged":[]}
[]
[null,"Total Revenue - State and Local"]
[null,null,"FY",2015]
[]
[null,null,"Per Capita",null,"% of Income"]
[null,"State","Amount","Rank","Amount","Rank"]
[null,"Alabama",7565.2828839764015,43,0.20546167380921573,24]
[null,"Alaska",14007.885048219528,5,0.25688092567261883,6]
[null,"Arizona",6850.3982939792677,48,0.18224038499726031,38]
[null,"Arkansas",7941.1575917134742,37,0.20970295979176659,19]
{"$rows_left_out":56}
{"sheet":"14 Total Revenue - S&L","index":9,"n_rows":65,"n_cols":6,"rows_kept":65,"cut":false,"hidden":true,"merged":[]}
[]
[null,"Total Revenue - State and Local"]
[null,null,"FY",2014]
[]
[null,null,"Per Capita",null,"% of Income"]
[null,"State","Amount","Rank","Amount","Rank"]
[null,"Alabama",7151.5549385181002,44,0.20045451273219542,25]
[null,"Alaska",19366.282297527505,1,0.37628525509036892,1]
[null,"Arizona",6662.4448864753276,48,0.18486788735113316,36]
[null,"Arkansas",7473.2816477199194,40,0.20825921787558377,19]
{"$rows_left_out":56}
{"sheet":"13 Total Revenue - S&L","index":10,"n_rows":65,"n_cols":6,"rows_kept":65,"cut":false,"hidden":true,"merged":[]}
[]
[null,"Total Revenue - State and Local"]
[null,null,"FY",2013]
[]
[null,null,"Per Capita",null,"% of Income"]
[null,"State","Amount","Rank","Amount","Rank"]
[null,"Alabama",7242.7881146863083,42,0.20200000000000001,23]
[null,"Alaska",20651.24850496717,1,0.39900000000000002,1]
[null,"Arizona",6686.4531710281071,48,0.184,35]
[null,"Arkansas",7237.2627458749403,43,0.2,24]
{"$rows_left_out":56}
{"sheet":"12 Total Revenue - S&L","index":11,"n_rows":65,"n_cols":6,"rows_kept":65,"cut":false,"hidden":true,"merged":[]}
[]
[null,"Total Revenue - State and Local"]
[null,null,"FY",2012]
[]
[null,null,"Per Capita",null,"% of Income"]
[null,"State","Amount","Rank","Amount","Rank"]
[null,"Alabama",7034.8442481025577,44,0.20043989838774501,27]
[null,"Alaska",23513.78503011373,1,0.47071231590610108,1]
[null,"Arizona",6622.8314997935386,47,0.18794859141156764,34]
[null,"Arkansas",7187.2877393753997,39,0.21243160461569333,19]
{"$rows_left_out":56}
{"sheet":"11 Total Revenue - S&L","index":12,"n_rows":65,"n_cols":6,"rows_kept":65,"cut":false,"hidden":true,"merged":[]}
[]
[null,"Total Revenue - State and Local"]
[null,null,"FY",2011]
[]
[null,null,"Per Capita",null,"% of Income"]
[null,"State","Amount","Rank","Amount","Rank"]
[null,"Alabama",7197.3,43,0.21299999999999999,28]
[null,"Alaska",21854.54,1,0.48499999999999999,1]
[null,"Arizona",6805.53,47,0.20200000000000001,34]
[null,"Arkansas",7331.31,39,0.23,17]
{"$rows_left_out":56}
{"sheet":"10 Total Revenue - S&L","index":13,"n_rows":65,"n_cols":6,"rows_kept":65,"cut":false,"hidden":true,"merged":[]}
[]
[null,"Total Revenue - State and Local"]
[null,null,"FY",2010]
[]
[null,null,"Per Capita",null,"% of Income"]
[null,"State","Amount","Rank","Amount","Rank"]
[null,"Alabama",7082.07,42,0.216,24]
[null,"Alaska",19658.849999999999,1,0.45400000000000001,1]
[null,"Arizona",6656.46,47,0.19800000000000001,34]
[null,"Arkansas",6928.03,43,0.221,20]
{"$rows_left_out":56}
{"sheet":"09 Total Revenue - S&L","index":14,"n_rows":65,"n_cols":6,"rows_kept":65,"cut":false,"hidden":true,"merged":[]}
[]
[null,"Total Revenue - State and Local"]
[null,null,"FY",2009]
[]
[null,null,"Per Capita",null,"% of Income"]
[null,"State","Amount","Rank","Amount","Rank"]
[null,"Alabama",6796.49,43,0.20100000000000001,25]
[null,"Alaska",20689.310000000001,1,0.46600000000000003,1]
[null,"Arizona",6248.83,49,0.183,35]
[null,"Arkansas",6572.81,47,0.20399999999999999,22]
{"$rows_left_out":56}
{"sheet":"08 Total Revenue - S&L","index":15,"n_rows":65,"n_cols":6,"rows_kept":65,"cut":false,"hidden":true,"merged":[]}
[]
[null,"Total Revenue - State and Local"]
[null,null,"FY",2008]
[]
[null,null,"Per Capita",null,"% of Income"]
[null,"State","Amount","Rank","Amount","Rank"]
[null,"Alabama",6775.23,41,0.20699999999999999,24]
[null,"Alaska",27117.91,1,0.65600000000000003,1]
[null,"Arizona",6503.64,49,0.191,37]
[null,"Arkansas",6416.15,50,0.20699999999999999,23]
{"$rows_left_out":56}
{"sheet":"07 Total Revenue - S&L","index":16,"n_rows":65,"n_cols":6,"rows_kept":65,"cut":false,"hidden":true,"merged":[]}
[]
[null,"Total Revenue - State and Local"]
[null,null,"FY",2007]
[]
[null,null,"Per Capita",null,"% of Income"]
[null,"State","Amount","Rank","Amount","Rank"]
[null,"Alabama",6658.39,40,0.21099999999999999,23]
[null,"Alaska",19005.810000000001,1,0.49,1]
[null,"Arizona",6471.28,45,0.19600000000000001,35]
[null,"Arkansas",6208.79,51,0.21199999999999999,19]
{"$rows_left_out":56}
{"sheet":"06 Total Revenue - S&L","index":17,"n_rows":65,"n_cols":6,"rows_kept":65,"cut":false,"hidden":true,"merged":[]}
[]
[null,"Total Revenue - State and Local"]
[null,null,"FY",2006]
[]
[null,null,"Per Capita",null,"% of Income"]
[null,"State","Amount","Rank","Amount","Rank"]
[null,"Alabama",6433.61,40,0.214,22]
[null,"Alaska",16275,1,0.441,1]
[null,"Arizona",6111.35,46,0.2,33]
[null,"Arkansas",6110.17,47,0.221,18]
{"$rows_left_out":56}
{"sheet":"05 Total Revenue - S&L","index":18,"n_rows":65,"n_cols":6,"rows_kept":65,"cut":false,"hidden":true,"merged":[]}
[]
[null,"Total Revenue - State and Local"]
[null,null,"FY",2005]
[]
[null,null,"Per Capita",null,"% of Income"]
[null,"State","Amount","Rank","Amount","Rank"]
[null,"Alabama",6022.02,39,0.20899999999999999,20]
[null,"Alaska",14675.07,1,0.41599999999999998,1]
[null,"Arizona",5616.75,50,0.19600000000000001,33]
[null,"Arkansas",5771.62,48,0.217,16]
{"$rows_left_out":56}
{"sheet":"04 Total Revenue - S&L","index":19,"n_rows":65,"n_cols":6,"rows_kept":65,"cut":false,"hidden":true,"merged":[]}
[]
[null,"Total Revenue - State and Local"]
[null,null,"FY",2004]
[]
[null,null,"Per Capita",null,"% of Income"]
[null,"State","Amount","Rank","Amount","Rank"]
[null,"Alabama",5622.14,41,0.20799999999999999,23]
[null,"Alaska",12882.38,2,0.377,1]
[null,"Arizona",5242.6899999999996,50,0.193,34]
[null,"Arkansas",5369.21,48,0.21199999999999999,17]
{"$rows_left_out":55}