{"text_format":"1","workbook":"xlsx","n_sheets":19,"sheets":["Total Tax Collections tables","21 Total Tax Collections - S&L","20 Total Tax Collections - S&L","19 Total Tax Collections - S&L","18 Total Tax Collections - S&L","17 Total Tax Collections - S&L","16 Total Tax Collections - S&L","15 Total Tax Collections - S&L","14 Total Tax Collections - S&L","13 Total Tax Collections - S&L","12 Total Tax Collections - S&L","11 Total Tax Collections - S&L","10 Total Tax Collections - S&L","09 Total Tax Collections - S&L","08 Total Tax Collections - S&L","07 Total Tax Collections - S&L","06 Total Tax Collections - S&L","05 Total Tax Collections - S&L","04 Total Tax Collections - S&L"],"not_rendered":{"charts":0,"images":57,"macros":1,"external_links":0,"defined_names":19,"comments":0,"pivot_tables":0},"unopened":[],"bounds":{"document_bytes":16777216,"sheet_cells":100000,"rows_first":2000,"rows_last":500,"rows_between":2000,"halvings":0,"cell_chars":16384,"cell_head_chars":4096},"cells_cut":0,"cells_raw":0,"read":"whole","date_system":"1900"}

{"sheet":"Total Tax Collections tables","index":0,"n_rows":69,"n_cols":12,"rows_kept":69,"cut":false,"hidden":false,"merged":[[58,2,59,2],[58,3,59,3],[58,4,59,4],[58,5,59,5],[0,0,67,0],[0,6,67,7],[68,0,68,7],[2,1,2,5],[5,2,5,3],[5,4,5,5],[1,1,1,5],[66,1,66,5],[67,1,67,5],[0,2,0,5],[60,1,60,5],[3,1,4,2],[3,3,4,5],[63,1,65,5],[61,1,62,5],[58,1,59,1]]}
["This cell intentionally left blank","Select Year","This cell intentionally left blank",null,null,null,"This cell intentionally left blank",null,null,null,null,"Select Year"]
[null,"This cell intentionally left blank",null,null,null,null,null,null,null,null,null,2021]
[null,"Total Tax Collections - State and Local",null,null,null,null,null,null,null,null,null,2020]
[null,"FY",null,{"$f":"IF(B1=2021,'21 Total Tax Collections - S&L'!D3,0)+IF(B1=2020,'20 Total Tax Collections - S&L'!D3,0)+IF(B1=2019,'19 Total Tax Collections - S&L'!D3,0)+IF(B1=2018,'18 Total Tax Collections - S&L'!D3,0)+IF(B1=2017,'17 Total Tax Collections - S&L'!D3,0)+IF(B1=2016,'16 Total Tax Collections - S&L'!D3,0)+IF(B1=2015,'15 Total Tax Collections - S&L'!D3,0)+IF(B1=2014,'14 Total Tax Collections - S&L'!D3,0)+IF(B1=2013,'13 Total Tax Collections - S&L'!D3,0)+IF(B1=2012,'12 Total Tax Collections - S&L'!D3,0)+IF(B1=2011,'11 Total Tax Collections - S&L'!D3,0)+IF(B1=2010,'10 Total Tax Collections - S&L'!D3,0)+IF(B1=2009,'09 Total Tax Collections - S&L'!D3,0)+IF(B1=2008,'08 Total Tax Collections - S&L'!D3,0)+IF(B1=2007,'07 Total Tax Collections - S&L'!D3,0)+IF(B1=2006,'06 Total Tax Collections - S&L'!D3,0)+IF(B1=2005,'05 Total Tax Collections - S&L'!D3)+IF(B1=2004,'04 Total Tax Collections - S&L'!D3,0)","v":0},null,null,null,null,null,null,null,2019]
[null,null,null,null,null,null,null,null,null,null,null,2018]
[null,"This cell intentionally left blank","Dollars Per Capita",null,"% of Income",null,null,null,null,null,null,2017]
[null,"State","Amount","Rank","Amount","Rank",null,null,null,null,null,2016]
[null,"Alabama",{"$f":"IF($B$1=2021,'21 Total Tax Collections - S&L'!C7,0)+IF($B$1=2020,'20 Total Tax Collections - S&L'!C7,0)+IF($B$1=2019,'19 Total Tax Collections - S&L'!C7,0)+IF($B$1=2018,'18 Total Tax Collections - S&L'!C7,0)+IF($B$1=2017,'17 Total Tax Collections - S&L'!C7,0)+IF($B$1=2016,'16 Total Tax Collections - S&L'!C7,0)+IF($B$1=2015,'15 Total Tax Collections - S&L'!C7,0)+IF($B$1=2014,'14 Total Tax Collections - S&L'!C7,0)+IF($B$1=2013,'13 Total Tax Collections - S&L'!C7,0)+IF($B$1=2012,'12 Total Tax Collections - S&L'!C7,0)+IF($B$1=2011,'11 Total Tax Collections - S&L'!C7,0)+IF($B$1=2010,'10 Total Tax Collections - S&L'!C7,0)+IF($B$1=2009,'09 Total Tax Collections - S&L'!C7,0)+IF($B$1=2008,'08 Total Tax Collections - S&L'!C7,0)+IF($B$1=2007,'07 Total Tax Collections - S&L'!C7,0)+IF($B$1=2006,'06 Total Tax Collections - S&L'!C7,0)+IF($B$1=2005,'05 Total Tax Collections - S&L'!C7,0)+IF($B$1=2004,'04 Total Tax Collections - S&L'!C7,0)","v":0},{"$f":"IF($B$1=2021,'21 Total Tax Collections - S&L'!D7,0)+IF($B$1=2020,'20 Total Tax Collections - S&L'!D7,0)+IF($B$1=2019,'19 Total Tax Collections - S&L'!D7,0)+IF($B$1=2018,'18 Total Tax Collections - S&L'!D7,0)+IF($B$1=2017,'17 Total Tax Collections - S&L'!D7,0)+IF($B$1=2016,'16 Total Tax Collections - S&L'!D7,0)+IF($B$1=2015,'15 Total Tax Collections - S&L'!D7,0)+IF($B$1=2014,'14 Total Tax Collections - S&L'!D7,0)+IF($B$1=2013,'13 Total Tax Collections - S&L'!D7,0)+IF($B$1=2012,'12 Total Tax Collections - S&L'!D7,0)+IF($B$1=2011,'11 Total Tax Collections - S&L'!D7,0)+IF($B$1=2010,'10 Total Tax Collections - S&L'!D7,0)+IF($B$1=2009,'09 Total Tax Collections - S&L'!D7,0)+IF($B$1=2008,'08 Total Tax Collections - S&L'!D7,0)+IF($B$1=2007,'07 Total Tax Collections - S&L'!D7,0)+IF($B$1=2006,'06 Total Tax Collections - S&L'!D7,0)+IF($B$1=2005,'05 Total Tax Collections - S&L'!D7,0)+IF($B$1=2004,'04 Total Tax Collections - S&L'!D7,0)","v":0},{"$f":"IF($B$1=2021,'21 Total Tax Collections - S&L'!E7,0)+IF($B$1=2020,'20 Total Tax Collections - S&L'!E7,0)+IF($B$1=2019,'19 Total Tax Collections - S&L'!E7,0)+IF($B$1=2018,'18 Total Tax Collections - S&L'!E7,0)+IF($B$1=2017,'17 Total Tax Collections - S&L'!E7,0)+IF($B$1=2016,'16 Total Tax Collections - S&L'!E7,0)+IF($B$1=2015,'15 Total Tax Collections - S&L'!E7,0)+IF($B$1=2014,'14 Total Tax Collections - S&L'!E7,0)+IF($B$1=2013,'13 Total Tax Collections - S&L'!E7,0)+IF($B$1=2012,'12 Total Tax Collections - S&L'!E7,0)+IF($B$1=2011,'11 Total Tax Collections - S&L'!E7,0)+IF($B$1=2010,'10 Total Tax Collections - S&L'!E7,0)+IF($B$1=2009,'09 Total Tax Collections - S&L'!E7,0)+IF($B$1=2008,'08 Total Tax Collections - S&L'!E7,0)+IF($B$1=2007,'07 Total Tax Collections - S&L'!E7,0)+IF($B$1=2006,'06 Total Tax Collections - S&L'!E7,0)+IF($B$1=2005,'05 Total Tax Collections - S&L'!E7,0)+IF($B$1=2004,'04 Total Tax Collections - S&L'!E7,0)","v":0},{"$f":"IF($B$1=2021,'21 Total Tax Collections - S&L'!F7,0)+IF($B$1=2020,'20 Total Tax Collections - S&L'!F7,0)+IF($B$1=2019,'19 Total Tax Collections - S&L'!F7,0)+IF($B$1=2018,'18 Total Tax Collections - S&L'!F7,0)+IF($B$1=2017,'17 Total Tax Collections - S&L'!F7,0)+IF($B$1=2016,'16 Total Tax Collections - S&L'!F7,0)+IF($B$1=2015,'15 Total Tax Collections - S&L'!F7,0)+IF($B$1=2014,'14 Total Tax Collections - S&L'!F7,0)+IF($B$1=2013,'13 Total Tax Collections - S&L'!F7,0)+IF($B$1=2012,'12 Total Tax Collections - S&L'!F7,0)+IF($B$1=2011,'11 Total Tax Collections - S&L'!F7,0)+IF($B$1=2010,'10 Total Tax Collections - S&L'!F7,0)+IF($B$1=2009,'09 Total Tax Collections - S&L'!F7,0)+IF($B$1=2008,'08 Total Tax Collections - S&L'!F7,0)+IF($B$1=2007,'07 Total Tax Collections - S&L'!F7,0)+IF($B$1=2006,'06 Total Tax Collections - S&L'!F7,0)+IF($B$1=2005,'05 Total Tax Collections - S&L'!F7,0)+IF($B$1=2004,'04 Total Tax Collections - S&L'!F7,0)","v":0},null,null,null,null,null,2015]
[null,"Alaska",{"$f":"IF($B$1=2021,'21 Total Tax Collections - S&L'!C8,0)+IF($B$1=2020,'20 Total Tax Collections - S&L'!C8,0)+IF($B$1=2019,'19 Total Tax Collections - S&L'!C8,0)+IF($B$1=2018,'18 Total Tax Collections - S&L'!C8,0)+IF($B$1=2017,'17 Total Tax Collections - S&L'!C8,0)+IF($B$1=2016,'16 Total Tax Collections - S&L'!C8,0)+IF($B$1=2015,'15 Total Tax Collections - S&L'!C8,0)+IF($B$1=2014,'14 Total Tax Collections - S&L'!C8,0)+IF($B$1=2013,'13 Total Tax Collections - S&L'!C8,0)+IF($B$1=2012,'12 Total Tax Collections - S&L'!C8,0)+IF($B$1=2011,'11 Total Tax Collections - S&L'!C8,0)+IF($B$1=2010,'10 Total Tax Collections - S&L'!C8,0)+IF($B$1=2009,'09 Total Tax Collections - S&L'!C8,0)+IF($B$1=2008,'08 Total Tax Collections - S&L'!C8,0)+IF($B$1=2007,'07 Total Tax Collections - S&L'!C8,0)+IF($B$1=2006,'06 Total Tax Collections - S&L'!C8,0)+IF($B$1=2005,'05 Total Tax Collections - S&L'!C8,0)+IF($B$1=2004,'04 Total Tax Collections - S&L'!C8,0)","v":0},{"$f":"IF($B$1=2021,'21 Total Tax Collections - S&L'!D8,0)+IF($B$1=2020,'20 Total Tax Collections - S&L'!D8,0)+IF($B$1=2019,'19 Total Tax Collections - S&L'!D8,0)+IF($B$1=2018,'18 Total Tax Collections - S&L'!D8,0)+IF($B$1=2017,'17 Total Tax Collections - S&L'!D8,0)+IF($B$1=2016,'16 Total Tax Collections - S&L'!D8,0)+IF($B$1=2015,'15 Total Tax Collections - S&L'!D8,0)+IF($B$1=2014,'14 Total Tax Collections - S&L'!D8,0)+IF($B$1=2013,'13 Total Tax Collections - S&L'!D8,0)+IF($B$1=2012,'12 Total Tax Collections - S&L'!D8,0)+IF($B$1=2011,'11 Total Tax Collections - S&L'!D8,0)+IF($B$1=2010,'10 Total Tax Collections - S&L'!D8,0)+IF($B$1=2009,'09 Total Tax Collections - S&L'!D8,0)+IF($B$1=2008,'08 Total Tax Collections - S&L'!D8,0)+IF($B$1=2007,'07 Total Tax Collections - S&L'!D8,0)+IF($B$1=2006,'06 Total Tax Collections - S&L'!D8,0)+IF($B$1=2005,'05 Total Tax Collections - S&L'!D8,0)+IF($B$1=2004,'04 Total Tax Collections - S&L'!D8,0)","v":0},{"$f":"IF($B$1=2021,'21 Total Tax Collections - S&L'!E8,0)+IF($B$1=2020,'20 Total Tax Collections - S&L'!E8,0)+IF($B$1=2019,'19 Total Tax Collections - S&L'!E8,0)+IF($B$1=2018,'18 Total Tax Collections - S&L'!E8,0)+IF($B$1=2017,'17 Total Tax Collections - S&L'!E8,0)+IF($B$1=2016,'16 Total Tax Collections - S&L'!E8,0)+IF($B$1=2015,'15 Total Tax Collections - S&L'!E8,0)+IF($B$1=2014,'14 Total Tax Collections - S&L'!E8,0)+IF($B$1=2013,'13 Total Tax Collections - S&L'!E8,0)+IF($B$1=2012,'12 Total Tax Collections - S&L'!E8,0)+IF($B$1=2011,'11 Total Tax Collections - S&L'!E8,0)+IF($B$1=2010,'10 Total Tax Collections - S&L'!E8,0)+IF($B$1=2009,'09 Total Tax Collections - S&L'!E8,0)+IF($B$1=2008,'08 Total Tax Collections - S&L'!E8,0)+IF($B$1=2007,'07 Total Tax Collections - S&L'!E8,0)+IF($B$1=2006,'06 Total Tax Collections - S&L'!E8,0)+IF($B$1=2005,'05 Total Tax Collections - S&L'!E8,0)+IF($B$1=2004,'04 Total Tax Collections - S&L'!E8,0)","v":0},{"$f":"IF($B$1=2021,'21 Total Tax Collections - S&L'!F8,0)+IF($B$1=2020,'20 Total Tax Collections - S&L'!F8,0)+IF($B$1=2019,'19 Total Tax Collections - S&L'!F8,0)+IF($B$1=2018,'18 Total Tax Collections - S&L'!F8,0)+IF($B$1=2017,'17 Total Tax Collections - S&L'!F8,0)+IF($B$1=2016,'16 Total Tax Collections - S&L'!F8,0)+IF($B$1=2015,'15 Total Tax Collections - S&L'!F8,0)+IF($B$1=2014,'14 Total Tax Collections - S&L'!F8,0)+IF($B$1=2013,'13 Total Tax Collections - S&L'!F8,0)+IF($B$1=2012,'12 Total Tax Collections - S&L'!F8,0)+IF($B$1=2011,'11 Total Tax Collections - S&L'!F8,0)+IF($B$1=2010,'10 Total Tax Collections - S&L'!F8,0)+IF($B$1=2009,'09 Total Tax Collections - S&L'!F8,0)+IF($B$1=2008,'08 Total Tax Collections - S&L'!F8,0)+IF($B$1=2007,'07 Total Tax Collections - S&L'!F8,0)+IF($B$1=2006,'06 Total Tax Collections - S&L'!F8,0)+IF($B$1=2005,'05 Total Tax Collections - S&L'!F8,0)+IF($B$1=2004,'04 Total Tax Collections - S&L'!F8,0)","v":0},null,null,null,null,null,2014]
[null,"Arizona",{"$f":"IF($B$1=2021,'21 Total Tax Collections - S&L'!C9,0)+IF($B$1=2020,'20 Total Tax Collections - S&L'!C9,0)+IF($B$1=2019,'19 Total Tax Collections - S&L'!C9,0)+IF($B$1=2018,'18 Total Tax Collections - S&L'!C9,0)+IF($B$1=2017,'17 Total Tax Collections - S&L'!C9,0)+IF($B$1=2016,'16 Total Tax Collections - S&L'!C9,0)+IF($B$1=2015,'15 Total Tax Collections - S&L'!C9,0)+IF($B$1=2014,'14 Total Tax Collections - S&L'!C9,0)+IF($B$1=2013,'13 Total Tax Collections - S&L'!C9,0)+IF($B$1=2012,'12 Total Tax Collections - S&L'!C9,0)+IF($B$1=2011,'11 Total Tax Collections - S&L'!C9,0)+IF($B$1=2010,'10 Total Tax Collections - S&L'!C9,0)+IF($B$1=2009,'09 Total Tax Collections - S&L'!C9,0)+IF($B$1=2008,'08 Total Tax Collections - S&L'!C9,0)+IF($B$1=2007,'07 Total Tax Collections - S&L'!C9,0)+IF($B$1=2006,'06 Total Tax Collections - S&L'!C9,0)+IF($B$1=2005,'05 Total Tax Collections - S&L'!C9,0)+IF($B$1=2004,'04 Total Tax Collections - S&L'!C9,0)","v":0},{"$f":"IF($B$1=2021,'21 Total Tax Collections - S&L'!D9,0)+IF($B$1=2020,'20 Total Tax Collections - S&L'!D9,0)+IF($B$1=2019,'19 Total Tax Collections - S&L'!D9,0)+IF($B$1=2018,'18 Total Tax Collections - S&L'!D9,0)+IF($B$1=2017,'17 Total Tax Collections - S&L'!D9,0)+IF($B$1=2016,'16 Total Tax Collections - S&L'!D9,0)+IF($B$1=2015,'15 Total Tax Collections - S&L'!D9,0)+IF($B$1=2014,'14 Total Tax Collections - S&L'!D9,0)+IF($B$1=2013,'13 Total Tax Collections - S&L'!D9,0)+IF($B$1=2012,'12 Total Tax Collections - S&L'!D9,0)+IF($B$1=2011,'11 Total Tax Collections - S&L'!D9,0)+IF($B$1=2010,'10 Total Tax Collections - S&L'!D9,0)+IF($B$1=2009,'09 Total Tax Collections - S&L'!D9,0)+IF($B$1=2008,'08 Total Tax Collections - S&L'!D9,0)+IF($B$1=2007,'07 Total Tax Collections - S&L'!D9,0)+IF($B$1=2006,'06 Total Tax Collections - S&L'!D9,0)+IF($B$1=2005,'05 Total Tax Collections - S&L'!D9,0)+IF($B$1=2004,'04 Total Tax Collections - S&L'!D9,0)","v":0},{"$f":"IF($B$1=2021,'21 Total Tax Collections - S&L'!E9,0)+IF($B$1=2020,'20 Total Tax Collections - S&L'!E9,0)+IF($B$1=2019,'19 Total Tax Collections - S&L'!E9,0)+IF($B$1=2018,'18 Total Tax Collections - S&L'!E9,0)+IF($B$1=2017,'17 Total Tax Collections - S&L'!E9,0)+IF($B$1=2016,'16 Total Tax Collections - S&L'!E9,0)+IF($B$1=2015,'15 Total Tax Collections - S&L'!E9,0)+IF($B$1=2014,'14 Total Tax Collections - S&L'!E9,0)+IF($B$1=2013,'13 Total Tax Collections - S&L'!E9,0)+IF($B$1=2012,'12 Total Tax Collections - S&L'!E9,0)+IF($B$1=2011,'11 Total Tax Collections - S&L'!E9,0)+IF($B$1=2010,'10 Total Tax Collections - S&L'!E9,0)+IF($B$1=2009,'09 Total Tax Collections - S&L'!E9,0)+IF($B$1=2008,'08 Total Tax Collections - S&L'!E9,0)+IF($B$1=2007,'07 Total Tax Collections - S&L'!E9,0)+IF($B$1=2006,'06 Total Tax Collections - S&L'!E9,0)+IF($B$1=2005,'05 Total Tax Collections - S&L'!E9,0)+IF($B$1=2004,'04 Total Tax Collections - S&L'!E9,0)","v":0},{"$f":"IF($B$1=2021,'21 Total Tax Collections - S&L'!F9,0)+IF($B$1=2020,'20 Total Tax Collections - S&L'!F9,0)+IF($B$1=2019,'19 Total Tax Collections - S&L'!F9,0)+IF($B$1=2018,'18 Total Tax Collections - S&L'!F9,0)+IF($B$1=2017,'17 Total Tax Collections - S&L'!F9,0)+IF($B$1=2016,'16 Total Tax Collections - S&L'!F9,0)+IF($B$1=2015,'15 Total Tax Collections - S&L'!F9,0)+IF($B$1=2014,'14 Total Tax Collections - S&L'!F9,0)+IF($B$1=2013,'13 Total Tax Collections - S&L'!F9,0)+IF($B$1=2012,'12 Total Tax Collections - S&L'!F9,0)+IF($B$1=2011,'11 Total Tax Collections - S&L'!F9,0)+IF($B$1=2010,'10 Total Tax Collections - S&L'!F9,0)+IF($B$1=2009,'09 Total Tax Collections - S&L'!F9,0)+IF($B$1=2008,'08 Total Tax Collections - S&L'!F9,0)+IF($B$1=2007,'07 Total Tax Collections - S&L'!F9,0)+IF($B$1=2006,'06 Total Tax Collections - S&L'!F9,0)+IF($B$1=2005,'05 Total Tax Collections - S&L'!F9,0)+IF($B$1=2004,'04 Total Tax Collections - S&L'!F9,0)","v":0},null,null,null,null,null,2013]
{"$rows_left_out":60}
{"sheet":"21 Total Tax Collections - S&L","index":1,"n_rows":65,"n_cols":6,"rows_kept":65,"cut":false,"hidden":true,"merged":[]}
[]
[null,"Total Tax Collections - State and Local"]
[null,null,"FY",2021]
[]
[null,null,"Per Capita",null,"% of Income"]
[null,"State","Amount","Rank","Amount","Rank"]
[null,"Alabama",4237.0761405397316,50,9.2677008878489689E-2,39]
[null,"Alaska",4188.8959413333478,51,6.7790672812197597E-2,51]
[null,"Arizona",4640.1739492630086,41,9.005939166224522E-2,41]
[null,"Arkansas",4856.6424998728589,36,0.10348553989572989,26]
{"$rows_left_out":56}
{"sheet":"20 Total Tax Collections - S&L","index":2,"n_rows":65,"n_cols":6,"rows_kept":65,"cut":false,"hidden":true,"merged":[]}
[]
[null,"Total Tax Collections - State and Local"]
[null,null,"FY",2020]
[]
[null,null,"Per Capita",null,"% of Income"]
[null,"State","Amount","Rank","Amount","Rank"]
[null,"Alabama",3834.9213212471236,50,8.7196928606738763E-2,43]
[null,"Alaska",4530.5939345531333,32,7.20986568752707E-2,51]
[null,"Arizona",4000.1254480117705,46,8.8552262522330824E-2,39]
[null,"Arkansas",4309.8608094579085,38,9.6977028230054788E-2,28]
{"$rows_left_out":56}
{"sheet":"19 Total Tax Collections - S&L","index":3,"n_rows":65,"n_cols":6,"rows_kept":65,"cut":false,"hidden":true,"merged":[]}
[]
[null,"Total Tax Collections - State and Local"]
[null,null,"FY",2019]
[]
[null,null,"Per Capita",null,"% of Income"]
[null,"State","Amount","Rank","Amount","Rank"]
[null,"Alabama",3676.3228391341545,51,8.634949871307053E-2,46]
[null,"Alaska",5121.3896616066004,27,8.4439052865024705E-2,48]
[null,"Arizona",4091.7367717415036,45,9.3296178917589193E-2,38]
[null,"Arkansas",4289.8299558221806,39,9.9280016871489102E-2,29]
{"$rows_left_out":56}
{"sheet":"18 Total Tax Collections - S&L","index":4,"n_rows":65,"n_cols":6,"rows_kept":65,"cut":false,"hidden":true,"merged":[]}
[]
[null,"Total Tax Collections - State and Local"]
[null,null,"FY",2018]
[]
[null,null,"Per Capita",null,"% of Income"]
[null,"State","Amount","Rank","Amount","Rank"]
[null,"Alabama",3526.6141550563552,50,8.6184911184911187E-2,48]
[null,"Alaska",4816.9557049755213,27,8.3410247229969092E-2,49]
[null,"Arizona",3824.2238360754309,47,9.1244005566527508E-2,38]
[null,"Arkansas",4135.205016524721,37,9.9546437252500897E-2,27]
{"$rows_left_out":56}
{"sheet":"17 Total Tax Collections - S&L","index":5,"n_rows":65,"n_cols":6,"rows_kept":65,"cut":false,"hidden":true,"merged":[]}
[]
[null,"Total Tax Collections - State and Local"]
[null,null,"FY",2017]
[]
[null,null,"Per Capita",null,"% of Income"]
[null,"State","Amount","Rank","Amount","Rank"]
[null,"Alabama",3370.4679837012559,50,8.5443814524404013E-2,47]
[null,"Alaska",4097.0366364742458,33,7.2596345483116789E-2,51]
[null,"Arizona",3672.5763230251869,46,9.1347884687568076E-2,37]
[null,"Arkansas",4004.6712390611547,36,9.9541028354874023E-2,27]
{"$rows_left_out":56}
{"sheet":"16 Total Tax Collections - S&L","index":6,"n_rows":65,"n_cols":6,"rows_kept":65,"cut":false,"hidden":true,"merged":[]}
[]
[null,"Total Tax Collections - State and Local"]
[null,null,"FY",2016]
[]
[null,null,"Per Capita",null,"% of Income"]
[null,"State","Amount","Rank","Amount","Rank"]
[null,"Alabama",3203.6462342836057,51,8.320762876558449E-2,46]
[null,"Alaska",3812.5579902468494,40,6.6847012366697406E-2,51]
[null,"Arizona",3562.5774967561506,45,9.1370379684106787E-2,35]
[null,"Arkansas",3954.7978370858846,31,0.1017342746493291,20]
{"$rows_left_out":56}
{"sheet":"15 Total Tax Collections - S&L","index":7,"n_rows":65,"n_cols":6,"rows_kept":65,"cut":false,"hidden":true,"merged":[]}
[]
[null,"Total Tax Collections - State and Local"]
[null,null,"FY",2015]
[]
[null,null,"Per Capita",null,"% of Income"]
[null,"State","Amount","Rank","Amount","Rank"]
[null,"Alabama",3146.3817328810696,51,8.5450982758320582E-2,46]
[null,"Alaska",3502.8815183087863,45,6.4236923978687382E-2,51]
[null,"Arizona",3493.1749174024758,46,9.292854436941253E-2,40]
[null,"Arkansas",3871.3823578635215,35,0.10223198942390423,28]
{"$rows_left_out":56}
{"sheet":"14 Total Tax Collections - S&L","index":8,"n_rows":65,"n_cols":6,"rows_kept":65,"cut":false,"hidden":true,"merged":[]}
[]
[null,"Total Tax Collections - State and Local"]
[null,null,"FY",2014]
[]
[null,null,"Per Capita",null,"% of Income"]
[null,"State","Amount","Rank","Amount","Rank"]
[null,"Alabama",3003.7974782861133,51,8.4194942922553931E-2,46]
[null,"Alaska",7558.6496630265838,4,0.14686393458974881,4]
[null,"Arizona",3349.9482811961261,46,9.2953543636428992E-2,40]
[null,"Arkansas",3755.7484010311059,36,0.10466208305889962,23]
{"$rows_left_out":56}
{"sheet":"13 Total Tax Collections - S&L","index":9,"n_rows":65,"n_cols":6,"rows_kept":65,"cut":false,"hidden":true,"merged":[]}
[]
[null,"Total Tax Collections - State and Local"]
[null,null,"FY",2013]
[]
[null,null,"Per Capita",null,"% of Income"]
[null,"State","Amount","Rank","Amount","Rank"]
[null,"Alabama",3048.2729338563672,51,8.4819480374208209E-2,47]
[null,"Alaska",9211.2261032054048,2,0.17776001361211835,1]
[null,"Arizona",3416.8446366719909,45,9.3935091247110303E-2,39]
[null,"Arkansas",3639.23343037103,37,0.10057387400771355,28]
{"$rows_left_out":56}
{"sheet":"12 Total Tax Collections - S&L","index":10,"n_rows":65,"n_cols":6,"rows_kept":65,"cut":false,"hidden":true,"merged":[]}
[]
[null,"Total Tax Collections - State and Local"]
[null,null,"FY",2012]
[]
[null,null,"Per Capita",null,"% of Income"]
[null,"State","Amount","Rank","Amount","Rank"]
[null,"Alabama",2963.6171590682816,51,8.4440692824726757E-2,47]
[null,"Alaska",11868.480145727463,1,0.23758998257942024,1]
[null,"Arizona",3378.2769558122354,43,9.5871742360176634E-2,37]
[null,"Arkansas",3523.8672737302168,38,0.10415344515986956,22]
{"$rows_left_out":56}
{"sheet":"11 Total Tax Collections - S&L","index":11,"n_rows":65,"n_cols":6,"rows_kept":65,"cut":false,"hidden":true,"merged":[]}
[]
[null,"Total Tax Collections - State and Local"]
[null,null,"FY",2011]
[]
[null,null,"Per Capita",null,"% of Income"]
[null,"State","Amount","Rank","Amount","Rank"]
[null,"Alabama",2889.15,51,8.5999999999999993E-2,49]
[null,"Alaska",10073.99,1,0.223,1]
[null,"Arizona",3348.45,40,9.9000000000000005E-2,36]
[null,"Arkansas",3385.89,39,0.106,21]
{"$rows_left_out":56}
{"sheet":"10 Total Tax Collections - S&L","index":12,"n_rows":65,"n_cols":6,"rows_kept":65,"cut":false,"hidden":true,"merged":[]}
[]
[null,"Total Tax Collections - State and Local"]
[null,null,"FY",2010]
[]
[null,null,"Per Capita",null,"% of Income"]
[null,"State","Amount","Rank","Amount","Rank"]
[null,"Alabama",2817.62,50,8.5999999999999993E-2,49]
[null,"Alaska",8636.7199999999993,1,0.19900000000000001,1]
[null,"Arizona",3147.9,43,9.4E-2,41]
[null,"Arkansas",3245.97,38,0.104,20]
{"$rows_left_out":56}
{"sheet":"09 Total Tax Collections - S&L","index":13,"n_rows":65,"n_cols":6,"rows_kept":65,"cut":false,"hidden":true,"merged":[]}
[]
[null,"Total Tax Collections - State and Local"]
[null,null,"FY",2009]
[]
[null,null,"Per Capita",null,"% of Income"]
[null,"State","Amount","Rank","Amount","Rank"]
[null,"Alabama",2866.97,50,8.5000000000000006E-2,49]
[null,"Alaska",9405.0499999999993,1,0.21199999999999999,1]
[null,"Arizona",3128.52,46,9.1999999999999998E-2,41]
[null,"Arkansas",3282.92,40,0.10199999999999999,21]
{"$rows_left_out":56}
{"sheet":"08 Total Tax Collections - S&L","index":14,"n_rows":65,"n_cols":6,"rows_kept":65,"cut":false,"hidden":true,"merged":[]}
[]
[null,"Total Tax Collections - State and Local"]
[null,null,"FY",2008]
[]
[null,null,"Per Capita",null,"% of Income"]
[null,"State","Amount","Rank","Amount","Rank"]
[null,"Alabama",2997.8,51,9.1999999999999998E-2,48]
[null,"Alaska",14594.36,1,0.35299999999999998,1]
[null,"Arizona",3451.48,39,0.10100000000000001,35]
[null,"Arkansas",3279.6,45,0.106,28]
{"$rows_left_out":56}
{"sheet":"07 Total Tax Collections - S&L","index":15,"n_rows":65,"n_cols":6,"rows_kept":65,"cut":false,"hidden":true,"merged":[]}
[]
[null,"Total Tax Collections - State and Local"]
[null,null,"FY",2007]
[]
[null,null,"Per Capita",null,"% of Income"]
[null,"State","Amount","Rank","Amount","Rank"]
[null,"Alabama",2913.05,51,9.1999999999999998E-2,49]
[null,"Alaska",7247.25,2,0.187,1]
[null,"Arizona",3666.97,32,0.111,22]
[null,"Arkansas",3223.29,44,0.11,24]
{"$rows_left_out":56}
{"sheet":"06 Total Tax Collections - S&L","index":16,"n_rows":65,"n_cols":6,"rows_kept":65,"cut":false,"hidden":true,"merged":[]}
[]
[null,"Total Tax Collections - State and Local"]
[null,null,"FY",2006]
[]
[null,null,"Per Capita",null,"% of Income"]
[null,"State","Amount","Rank","Amount","Rank"]
[null,"Alabama",2774.44,51,9.1999999999999998E-2,48]
[null,"Alaska",5410.59,6,0.14699999999999999,3]
[null,"Arizona",3439.02,35,0.112,22]
[null,"Arkansas",3105.44,45,0.112,23]
{"$rows_left_out":56}
{"sheet":"05 Total Tax Collections - S&L","index":17,"n_rows":65,"n_cols":6,"rows_kept":65,"cut":false,"hidden":true,"merged":[]}
[]
[null,"Total Tax Collections - State and Local"]
[null,null,"FY",2005]
[]
[null,null,"Per Capita",null,"% of Income"]
[null,"State","Amount","Rank","Amount","Rank"]
[null,"Alabama",2565.64,51,8.8999999999999996E-2,48]
[null,"Alaska",4401.92,7,0.125,6]
[null,"Arizona",3036.61,37,0.106,28]
[null,"Arkansas",2896.09,45,0.109,23]
{"$rows_left_out":56}
{"sheet":"04 Total Tax Collections - S&L","index":18,"n_rows":65,"n_cols":6,"rows_kept":65,"cut":false,"hidden":true,"merged":[]}
[]
[null,"Total Tax Collections - State and Local"]
[null,null,"FY",2004]
[]
[null,null,"Per Capita",null,"% of Income"]
[null,"State","Amount","Rank","Amount","Rank"]
[null,"Alabama",2334.87,51,8.5999999999999993E-2,50]
[null,"Alaska",3580.71,17,0.105,23]
[null,"Arizona",2861.6,38,0.105,22]
[null,"Arkansas",2539.2399999999998,49,0.1,37]
{"$rows_left_out":55}