{"text_format":"1","workbook":"xlsx","n_sheets":19,"sheets":["Individual Income Tax tables","21 Individual Income Tax - S&L","20 Individual Income Tax - S&L","19 Individual Income Tax - S&L","18 Individual Income Tax - S&L","17 Individual Income Tax - S&L","16 Individual Income Tax - S&L","15 Individual Income Tax - S&L","14 Individual Income Tax - S&L","13 Individual Income Tax - S&L","12 Individual Income Tax - S&L","11 Individual Income Tax - S&L","10 Individual Income Tax - S&L","09 Individual Income Tax - S&L","08 Individual Income Tax - S&L","07 Individual Income Tax - S&L","06 Individual Income Tax - S&L","05 Individual Income Tax - S&L","04 Individual Income Tax - S&L"],"not_rendered":{"charts":0,"images":57,"macros":1,"external_links":0,"defined_names":19,"comments":0,"pivot_tables":0},"unopened":[],"bounds":{"document_bytes":16777216,"sheet_cells":100000,"rows_first":2000,"rows_last":500,"rows_between":2000,"halvings":0,"cell_chars":16384,"cell_head_chars":4096},"cells_cut":0,"cells_raw":0,"read":"whole","date_system":"1900"}

{"sheet":"Individual Income Tax tables","index":0,"n_rows":70,"n_cols":12,"rows_kept":70,"cut":false,"hidden":false,"merged":[[69,0,69,7],[2,1,2,5],[5,2,5,3],[5,4,5,5],[68,1,68,5],[67,1,67,5],[58,1,59,1],[58,2,59,2],[58,3,60,3],[61,1,61,5],[0,0,68,0],[1,1,1,5],[0,2,0,5],[58,4,59,4],[58,5,60,5],[62,1,63,5],[64,1,66,5],[3,1,4,2],[3,3,4,5],[0,6,68,7]]}
["This cell intentionally left blank","Select Year","This cell intentionally left blank",null,null,null,"This cell intentionally left blank",null,null,null,null,"Select Year"]
[null,"This cell intentionally left blank",null,null,null,null,null,null,null,null,null,2021]
[null,"Individual Income Tax - State and Local",null,null,null,null,null,null,null,null,null,2020]
[null,"FY",null,{"$f":"IF(B1=2021,'21 Individual Income Tax - S&L'!D3,0)+IF(B1=2020,'20 Individual Income Tax - S&L'!D3,0)+IF(B1=2019,'19 Individual Income Tax - S&L'!D3,0)+IF(B1=2018,'18 Individual Income Tax - S&L'!D3,0)+IF(B1=2017,'17 Individual Income Tax - S&L'!D3,0)+IF(B1=2016,'16 Individual Income Tax - S&L'!D3,0)+IF(B1=2015,'15 Individual Income Tax - S&L'!D3,0)+IF(B1=2014,'14 Individual Income Tax - S&L'!D3,0)+IF(B1=2013,'13 Individual Income Tax - S&L'!D3,0)+IF(B1=2012,'12 Individual Income Tax - S&L'!D3,0)+IF(B1=2011,'11 Individual Income Tax - S&L'!D3,0)+IF(B1=2010,'10 Individual Income Tax - S&L'!D3,0)+IF(B1=2009,'09 Individual Income Tax - S&L'!D3,0)+IF(B1=2008,'08 Individual Income Tax - S&L'!D3,0)+IF(B1=2007,'07 Individual Income Tax - S&L'!D3,0)+IF(B1=2006,'06 Individual Income Tax - S&L'!D3,0)+IF(B1=2005,'05 Individual Income Tax - S&L'!D3)+IF(B1=2004,'04 Individual Income Tax - S&L'!D3,0)","v":0},null,null,null,null,null,null,null,2019]
[null,null,null,null,null,null,null,null,null,null,null,2018]
[null,"This cell intentionally left blank","Dollars Per Capita",null,"% of Income",null,null,null,null,null,null,2017]
[null,"State","Amount","Rank","Amount","Rank",null,null,null,null,null,2016]
[null,"Alabama",{"$f":"IF($B$1=2021,'21 Individual Income Tax - S&L'!C7,0)+IF($B$1=2020,'20 Individual Income Tax - S&L'!C7,0)+IF($B$1=2019,'19 Individual Income Tax - S&L'!C7,0)+IF($B$1=2018,'18 Individual Income Tax - S&L'!C7,0)+IF($B$1=2017,'17 Individual Income Tax - S&L'!C7,0)+IF($B$1=2016,'16 Individual Income Tax - S&L'!C7,0)+IF($B$1=2015,'15 Individual Income Tax - S&L'!C7,0)+IF($B$1=2014,'14 Individual Income Tax - S&L'!C7,0)+IF($B$1=2013,'13 Individual Income Tax - S&L'!C7,0)+IF($B$1=2012,'12 Individual Income Tax - S&L'!C7,0)+IF($B$1=2011,'11 Individual Income Tax - S&L'!C7,0)+IF($B$1=2010,'10 Individual Income Tax - S&L'!C7,0)+IF($B$1=2009,'09 Individual Income Tax - S&L'!C7,0)+IF($B$1=2008,'08 Individual Income Tax - S&L'!C7,0)+IF($B$1=2007,'07 Individual Income Tax - S&L'!C7,0)+IF($B$1=2006,'06 Individual Income Tax - S&L'!C7,0)+IF($B$1=2005,'05 Individual Income Tax - S&L'!C7,0)+IF($B$1=2004,'04 Individual Income Tax - S&L'!C7,0)","v":0},{"$f":"IF($B$1=2021,'21 Individual Income Tax - S&L'!D7,0)+IF($B$1=2020,'20 Individual Income Tax - S&L'!D7,0)+IF($B$1=2019,'19 Individual Income Tax - S&L'!D7,0)+IF($B$1=2018,'18 Individual Income Tax - S&L'!D7,0)+IF($B$1=2017,'17 Individual Income Tax - S&L'!D7,0)+IF($B$1=2016,'16 Individual Income Tax - S&L'!D7,0)+IF($B$1=2015,'15 Individual Income Tax - S&L'!D7,0)+IF($B$1=2014,'14 Individual Income Tax - S&L'!D7,0)+IF($B$1=2013,'13 Individual Income Tax - S&L'!D7,0)+IF($B$1=2012,'12 Individual Income Tax - S&L'!D7,0)+IF($B$1=2011,'11 Individual Income Tax - S&L'!D7,0)+IF($B$1=2010,'10 Individual Income Tax - S&L'!D7,0)+IF($B$1=2009,'09 Individual Income Tax - S&L'!D7,0)+IF($B$1=2008,'08 Individual Income Tax - S&L'!D7,0)+IF($B$1=2007,'07 Individual Income Tax - S&L'!D7,0)+IF($B$1=2006,'06 Individual Income Tax - S&L'!D7,0)+IF($B$1=2005,'05 Individual Income Tax - S&L'!D7,0)+IF($B$1=2004,'04 Individual Income Tax - S&L'!D7,0)","v":0},{"$f":"IF($B$1=2021,'21 Individual Income Tax - S&L'!E7,0)+IF($B$1=2020,'20 Individual Income Tax - S&L'!E7,0)+IF($B$1=2019,'19 Individual Income Tax - S&L'!E7,0)+IF($B$1=2018,'18 Individual Income Tax - S&L'!E7,0)+IF($B$1=2017,'17 Individual Income Tax - S&L'!E7,0)+IF($B$1=2016,'16 Individual Income Tax - S&L'!E7,0)+IF($B$1=2015,'15 Individual Income Tax - S&L'!E7,0)+IF($B$1=2014,'14 Individual Income Tax - S&L'!E7,0)+IF($B$1=2013,'13 Individual Income Tax - S&L'!E7,0)+IF($B$1=2012,'12 Individual Income Tax - S&L'!E7,0)+IF($B$1=2011,'11 Individual Income Tax - S&L'!E7,0)+IF($B$1=2010,'10 Individual Income Tax - S&L'!E7,0)+IF($B$1=2009,'09 Individual Income Tax - S&L'!E7,0)+IF($B$1=2008,'08 Individual Income Tax - S&L'!E7,0)+IF($B$1=2007,'07 Individual Income Tax - S&L'!E7,0)+IF($B$1=2006,'06 Individual Income Tax - S&L'!E7,0)+IF($B$1=2005,'05 Individual Income Tax - S&L'!E7,0)+IF($B$1=2004,'04 Individual Income Tax - S&L'!E7,0)","v":0},{"$f":"IF($B$1=2021,'21 Individual Income Tax - S&L'!F7,0)+IF($B$1=2020,'20 Individual Income Tax - S&L'!F7,0)+IF($B$1=2019,'19 Individual Income Tax - S&L'!F7,0)+IF($B$1=2018,'18 Individual Income Tax - S&L'!F7,0)+IF($B$1=2017,'17 Individual Income Tax - S&L'!F7,0)+IF($B$1=2016,'16 Individual Income Tax - S&L'!F7,0)+IF($B$1=2015,'15 Individual Income Tax - S&L'!F7,0)+IF($B$1=2014,'14 Individual Income Tax - S&L'!F7,0)+IF($B$1=2013,'13 Individual Income Tax - S&L'!F7,0)+IF($B$1=2012,'12 Individual Income Tax - S&L'!F7,0)+IF($B$1=2011,'11 Individual Income Tax - S&L'!F7,0)+IF($B$1=2010,'10 Individual Income Tax - S&L'!F7,0)+IF($B$1=2009,'09 Individual Income Tax - S&L'!F7,0)+IF($B$1=2008,'08 Individual Income Tax - S&L'!F7,0)+IF($B$1=2007,'07 Individual Income Tax - S&L'!F7,0)+IF($B$1=2006,'06 Individual Income Tax - S&L'!F7,0)+IF($B$1=2005,'05 Individual Income Tax - S&L'!F7,0)+IF($B$1=2004,'04 Individual Income Tax - S&L'!F7,0)","v":0},null,null,null,null,null,2015]
[null,"Alaska",{"$f":"IF($B$1=2021,'21 Individual Income Tax - S&L'!C8,0)+IF($B$1=2020,'20 Individual Income Tax - S&L'!C8,0)+IF($B$1=2019,'19 Individual Income Tax - S&L'!C8,0)+IF($B$1=2018,'18 Individual Income Tax - S&L'!C8,0)+IF($B$1=2017,'17 Individual Income Tax - S&L'!C8,0)+IF($B$1=2016,'16 Individual Income Tax - S&L'!C8,0)+IF($B$1=2015,'15 Individual Income Tax - S&L'!C8,0)+IF($B$1=2014,'14 Individual Income Tax - S&L'!C8,0)+IF($B$1=2013,'13 Individual Income Tax - S&L'!C8,0)+IF($B$1=2012,'12 Individual Income Tax - S&L'!C8,0)+IF($B$1=2011,'11 Individual Income Tax - S&L'!C8,0)+IF($B$1=2010,'10 Individual Income Tax - S&L'!C8,0)+IF($B$1=2009,'09 Individual Income Tax - S&L'!C8,0)+IF($B$1=2008,'08 Individual Income Tax - S&L'!C8,0)+IF($B$1=2007,'07 Individual Income Tax - S&L'!C8,0)+IF($B$1=2006,'06 Individual Income Tax - S&L'!C8,0)+IF($B$1=2005,'05 Individual Income Tax - S&L'!C8,0)+IF($B$1=2004,'04 Individual Income Tax - S&L'!C8,0)","v":0},{"$f":"IF($B$1=2021,'21 Individual Income Tax - S&L'!D8,0)+IF($B$1=2020,'20 Individual Income Tax - S&L'!D8,0)+IF($B$1=2019,'19 Individual Income Tax - S&L'!D8,0)+IF($B$1=2018,'18 Individual Income Tax - S&L'!D8,0)+IF($B$1=2017,'17 Individual Income Tax - S&L'!D8,0)+IF($B$1=2016,'16 Individual Income Tax - S&L'!D8,0)+IF($B$1=2015,'15 Individual Income Tax - S&L'!D8,0)+IF($B$1=2014,'14 Individual Income Tax - S&L'!D8,0)+IF($B$1=2013,'13 Individual Income Tax - S&L'!D8,0)+IF($B$1=2012,'12 Individual Income Tax - S&L'!D8,0)+IF($B$1=2011,'11 Individual Income Tax - S&L'!D8,0)+IF($B$1=2010,'10 Individual Income Tax - S&L'!D8,0)+IF($B$1=2009,'09 Individual Income Tax - S&L'!D8,0)+IF($B$1=2008,'08 Individual Income Tax - S&L'!D8,0)+IF($B$1=2007,'07 Individual Income Tax - S&L'!D8,0)+IF($B$1=2006,'06 Individual Income Tax - S&L'!D8,0)+IF($B$1=2005,'05 Individual Income Tax - S&L'!D8,0)+IF($B$1=2004,'04 Individual Income Tax - S&L'!D8,0)","v":0},{"$f":"IF($B$1=2021,'21 Individual Income Tax - S&L'!E8,0)+IF($B$1=2020,'20 Individual Income Tax - S&L'!E8,0)+IF($B$1=2019,'19 Individual Income Tax - S&L'!E8,0)+IF($B$1=2018,'18 Individual Income Tax - S&L'!E8,0)+IF($B$1=2017,'17 Individual Income Tax - S&L'!E8,0)+IF($B$1=2016,'16 Individual Income Tax - S&L'!E8,0)+IF($B$1=2015,'15 Individual Income Tax - S&L'!E8,0)+IF($B$1=2014,'14 Individual Income Tax - S&L'!E8,0)+IF($B$1=2013,'13 Individual Income Tax - S&L'!E8,0)+IF($B$1=2012,'12 Individual Income Tax - S&L'!E8,0)+IF($B$1=2011,'11 Individual Income Tax - S&L'!E8,0)+IF($B$1=2010,'10 Individual Income Tax - S&L'!E8,0)+IF($B$1=2009,'09 Individual Income Tax - S&L'!E8,0)+IF($B$1=2008,'08 Individual Income Tax - S&L'!E8,0)+IF($B$1=2007,'07 Individual Income Tax - S&L'!E8,0)+IF($B$1=2006,'06 Individual Income Tax - S&L'!E8,0)+IF($B$1=2005,'05 Individual Income Tax - S&L'!E8,0)+IF($B$1=2004,'04 Individual Income Tax - S&L'!E8,0)","v":0},{"$f":"IF($B$1=2021,'21 Individual Income Tax - S&L'!F8,0)+IF($B$1=2020,'20 Individual Income Tax - S&L'!F8,0)+IF($B$1=2019,'19 Individual Income Tax - S&L'!F8,0)+IF($B$1=2018,'18 Individual Income Tax - S&L'!F8,0)+IF($B$1=2017,'17 Individual Income Tax - S&L'!F8,0)+IF($B$1=2016,'16 Individual Income Tax - S&L'!F8,0)+IF($B$1=2015,'15 Individual Income Tax - S&L'!F8,0)+IF($B$1=2014,'14 Individual Income Tax - S&L'!F8,0)+IF($B$1=2013,'13 Individual Income Tax - S&L'!F8,0)+IF($B$1=2012,'12 Individual Income Tax - S&L'!F8,0)+IF($B$1=2011,'11 Individual Income Tax - S&L'!F8,0)+IF($B$1=2010,'10 Individual Income Tax - S&L'!F8,0)+IF($B$1=2009,'09 Individual Income Tax - S&L'!F8,0)+IF($B$1=2008,'08 Individual Income Tax - S&L'!F8,0)+IF($B$1=2007,'07 Individual Income Tax - S&L'!F8,0)+IF($B$1=2006,'06 Individual Income Tax - S&L'!F8,0)+IF($B$1=2005,'05 Individual Income Tax - S&L'!F8,0)+IF($B$1=2004,'04 Individual Income Tax - S&L'!F8,0)","v":0},null,null,null,null,null,2014]
[null,"Arizona",{"$f":"IF($B$1=2021,'21 Individual Income Tax - S&L'!C9,0)+IF($B$1=2020,'20 Individual Income Tax - S&L'!C9,0)+IF($B$1=2019,'19 Individual Income Tax - S&L'!C9,0)+IF($B$1=2018,'18 Individual Income Tax - S&L'!C9,0)+IF($B$1=2017,'17 Individual Income Tax - S&L'!C9,0)+IF($B$1=2016,'16 Individual Income Tax - S&L'!C9,0)+IF($B$1=2015,'15 Individual Income Tax - S&L'!C9,0)+IF($B$1=2014,'14 Individual Income Tax - S&L'!C9,0)+IF($B$1=2013,'13 Individual Income Tax - S&L'!C9,0)+IF($B$1=2012,'12 Individual Income Tax - S&L'!C9,0)+IF($B$1=2011,'11 Individual Income Tax - S&L'!C9,0)+IF($B$1=2010,'10 Individual Income Tax - S&L'!C9,0)+IF($B$1=2009,'09 Individual Income Tax - S&L'!C9,0)+IF($B$1=2008,'08 Individual Income Tax - S&L'!C9,0)+IF($B$1=2007,'07 Individual Income Tax - S&L'!C9,0)+IF($B$1=2006,'06 Individual Income Tax - S&L'!C9,0)+IF($B$1=2005,'05 Individual Income Tax - S&L'!C9,0)+IF($B$1=2004,'04 Individual Income Tax - S&L'!C9,0)","v":0},{"$f":"IF($B$1=2021,'21 Individual Income Tax - S&L'!D9,0)+IF($B$1=2020,'20 Individual Income Tax - S&L'!D9,0)+IF($B$1=2019,'19 Individual Income Tax - S&L'!D9,0)+IF($B$1=2018,'18 Individual Income Tax - S&L'!D9,0)+IF($B$1=2017,'17 Individual Income Tax - S&L'!D9,0)+IF($B$1=2016,'16 Individual Income Tax - S&L'!D9,0)+IF($B$1=2015,'15 Individual Income Tax - S&L'!D9,0)+IF($B$1=2014,'14 Individual Income Tax - S&L'!D9,0)+IF($B$1=2013,'13 Individual Income Tax - S&L'!D9,0)+IF($B$1=2012,'12 Individual Income Tax - S&L'!D9,0)+IF($B$1=2011,'11 Individual Income Tax - S&L'!D9,0)+IF($B$1=2010,'10 Individual Income Tax - S&L'!D9,0)+IF($B$1=2009,'09 Individual Income Tax - S&L'!D9,0)+IF($B$1=2008,'08 Individual Income Tax - S&L'!D9,0)+IF($B$1=2007,'07 Individual Income Tax - S&L'!D9,0)+IF($B$1=2006,'06 Individual Income Tax - S&L'!D9,0)+IF($B$1=2005,'05 Individual Income Tax - S&L'!D9,0)+IF($B$1=2004,'04 Individual Income Tax - S&L'!D9,0)","v":0},{"$f":"IF($B$1=2021,'21 Individual Income Tax - S&L'!E9,0)+IF($B$1=2020,'20 Individual Income Tax - S&L'!E9,0)+IF($B$1=2019,'19 Individual Income Tax - S&L'!E9,0)+IF($B$1=2018,'18 Individual Income Tax - S&L'!E9,0)+IF($B$1=2017,'17 Individual Income Tax - S&L'!E9,0)+IF($B$1=2016,'16 Individual Income Tax - S&L'!E9,0)+IF($B$1=2015,'15 Individual Income Tax - S&L'!E9,0)+IF($B$1=2014,'14 Individual Income Tax - S&L'!E9,0)+IF($B$1=2013,'13 Individual Income Tax - S&L'!E9,0)+IF($B$1=2012,'12 Individual Income Tax - S&L'!E9,0)+IF($B$1=2011,'11 Individual Income Tax - S&L'!E9,0)+IF($B$1=2010,'10 Individual Income Tax - S&L'!E9,0)+IF($B$1=2009,'09 Individual Income Tax - S&L'!E9,0)+IF($B$1=2008,'08 Individual Income Tax - S&L'!E9,0)+IF($B$1=2007,'07 Individual Income Tax - S&L'!E9,0)+IF($B$1=2006,'06 Individual Income Tax - S&L'!E9,0)+IF($B$1=2005,'05 Individual Income Tax - S&L'!E9,0)+IF($B$1=2004,'04 Individual Income Tax - S&L'!E9,0)","v":0},{"$f":"IF($B$1=2021,'21 Individual Income Tax - S&L'!F9,0)+IF($B$1=2020,'20 Individual Income Tax - S&L'!F9,0)+IF($B$1=2019,'19 Individual Income Tax - S&L'!F9,0)+IF($B$1=2018,'18 Individual Income Tax - S&L'!F9,0)+IF($B$1=2017,'17 Individual Income Tax - S&L'!F9,0)+IF($B$1=2016,'16 Individual Income Tax - S&L'!F9,0)+IF($B$1=2015,'15 Individual Income Tax - S&L'!F9,0)+IF($B$1=2014,'14 Individual Income Tax - S&L'!F9,0)+IF($B$1=2013,'13 Individual Income Tax - S&L'!F9,0)+IF($B$1=2012,'12 Individual Income Tax - S&L'!F9,0)+IF($B$1=2011,'11 Individual Income Tax - S&L'!F9,0)+IF($B$1=2010,'10 Individual Income Tax - S&L'!F9,0)+IF($B$1=2009,'09 Individual Income Tax - S&L'!F9,0)+IF($B$1=2008,'08 Individual Income Tax - S&L'!F9,0)+IF($B$1=2007,'07 Individual Income Tax - S&L'!F9,0)+IF($B$1=2006,'06 Individual Income Tax - S&L'!F9,0)+IF($B$1=2005,'05 Individual Income Tax - S&L'!F9,0)+IF($B$1=2004,'04 Individual Income Tax - S&L'!F9,0)","v":0},null,null,null,null,null,2013]
{"$rows_left_out":61}
{"sheet":"21 Individual Income Tax - S&L","index":1,"n_rows":66,"n_cols":6,"rows_kept":66,"cut":false,"hidden":true,"merged":[]}
[]
[null,"Individual Income Tax - State and Local"]
[null,null,"FY",2021]
[]
[null,null,"Per Capita",null,"% of Income"]
[null,"State","Amount","Rank","Amount","Rank"]
[null,"Alabama",972.07657421632268,34,2.1262102995331624E-2,33]
[null,"Alaska",0,"0",0,"0"]
[null,"Arizona",899.224171310815,37,1.74527038688067E-2,37]
[null,"Arkansas",1144.9806183502515,32,2.4397294522548105E-2,29]
{"$rows_left_out":57}
{"sheet":"20 Individual Income Tax - S&L","index":2,"n_rows":66,"n_cols":6,"rows_kept":66,"cut":false,"hidden":true,"merged":[]}
[]
[null,"Individual Income Tax - State and Local"]
[null,null,"FY",2020]
[]
[null,null,"Per Capita",null,"% of Income"]
[null,"State","Amount","Rank","Amount","Rank"]
[null,"Alabama",896.70492846536399,36,2.0388923025747407E-2,35]
[null,"Alaska",0,"0",0,"0"]
[null,"Arizona",610.45212352761962,40,1.3513805354979716E-2,41]
[null,"Arkansas",961.86036596995507,35,2.1643009829770264E-2,31]
{"$rows_left_out":57}
{"sheet":"19 Individual Income Tax - S&L","index":3,"n_rows":66,"n_cols":6,"rows_kept":66,"cut":false,"hidden":true,"merged":[]}
[]
[null,"Individual Income Tax - State and Local"]
[null,null,"FY",2019]
[]
[null,null,"Per Capita",null,"% of Income"]
[null,"State","Amount","Rank","Amount","Rank"]
[null,"Alabama",884.14326606073394,37,2.0766763735271445E-2,36]
[null,"Alaska",0,"0",0,"0"]
[null,"Arizona",736.01583905515224,40,1.6781985068272883E-2,41]
[null,"Arkansas",998.23944828756271,33,2.3102367760118099E-2,32]
{"$rows_left_out":57}
{"sheet":"18 Individual Income Tax - S&L","index":4,"n_rows":66,"n_cols":6,"rows_kept":66,"cut":false,"hidden":true,"merged":[]}
[]
[null,"Individual Income Tax - State and Local"]
[null,null,"FY",2018]
[]
[null,null,"Per Capita",null,"% of Income"]
[null,"State","Amount","Rank","Amount","Rank"]
[null,"Alabama",826.60447766537959,37,2.0200915200915201E-2,37]
[null,"Alaska",0,"0",0,"0"]
[null,"Arizona",634.9855770251678,39,1.5150427905969018E-2,40]
[null,"Arkansas",952.3020812809641,34,2.2924686684417682E-2,32]
{"$rows_left_out":57}
{"sheet":"17 Individual Income Tax - S&L","index":5,"n_rows":66,"n_cols":6,"rows_kept":66,"cut":false,"hidden":true,"merged":[]}
[]
[null,"Individual Income Tax - State and Local"]
[null,null,"FY",2017]
[]
[null,null,"Per Capita",null,"% of Income"]
[null,"State","Amount","Rank","Amount","Rank"]
[null,"Alabama",769.06857461484151,37,1.9496447663560637E-2,35]
[null,"Alaska",0,"0",0,"0"]
[null,"Arizona",586.54405276087141,41,1.4589093264001714E-2,41]
[null,"Arkansas",922.17555795818214,33,2.2921807530050138E-2,30]
{"$rows_left_out":57}
{"sheet":"16 Individual Income Tax - S&L","index":6,"n_rows":66,"n_cols":6,"rows_kept":66,"cut":false,"hidden":true,"merged":[]}
[]
[null,"Individual Income Tax - State and Local"]
[null,null,"FY",2016]
[]
[null,null,"Per Capita",null,"% of Income"]
[null,"State","Amount","Rank","Amount","Rank"]
[null,"Alabama",742.57396841972195,37,1.9286717251747985E-2,35]
[null,"Alaska",0,"0",0,"0"]
[null,"Arizona",571.29816749147494,41,1.4652237186155289E-2,40]
[null,"Arkansas",930.12596934868463,32,2.3926808580920542E-2,25]
{"$rows_left_out":57}
{"sheet":"15 Individual Income Tax - S&L","index":7,"n_rows":66,"n_cols":6,"rows_kept":66,"cut":false,"hidden":true,"merged":[]}
[]
[null,"Individual Income Tax - State and Local"]
[null,null,"FY",2015]
[]
[null,null,"Per Capita",null,"% of Income"]
[null,"State","Amount","Rank","Amount","Rank"]
[null,"Alabama",710.49698836783102,38,1.9296026692624174E-2,35]
[null,"Alaska",0,"0",0,"0"]
[null,"Arizona",552.88711313971737,42,1.4708394466225596E-2,41]
[null,"Arkansas",895.32521896232925,33,2.3642944523419335E-2,32]
{"$rows_left_out":57}
{"sheet":"14 Individual Income Tax - S&L","index":8,"n_rows":66,"n_cols":6,"rows_kept":66,"cut":false,"hidden":true,"merged":[]}
[]
[null,"Individual Income Tax - State and Local"]
[null,null,"FY",2014]
[]
[null,null,"Per Capita",null,"% of Income"]
[null,"State","Amount","Rank","Amount","Rank"]
[null,"Alabama",682.72927853280896,37,1.9136560654689733E-2,35]
[null,"Alaska",0,"0",0,"0"]
[null,"Arizona",515.24056647082818,42,1.429676892253506E-2,41]
[null,"Arkansas",877.06005435954967,31,2.4441182543490068E-2,24]
{"$rows_left_out":57}
{"sheet":"13 Individual Income Tax - S&L","index":9,"n_rows":66,"n_cols":6,"rows_kept":66,"cut":false,"hidden":true,"merged":[]}
[]
[null,"Individual Income Tax - State and Local"]
[null,null,"FY",2013]
[]
[null,null,"Per Capita",null,"% of Income"]
[null,"State","Amount","Rank","Amount","Rank"]
[null,"Alabama",686.53065821100893,38,1.9103005194732584E-2,36]
[null,"Alaska",0,"0",0,"0"]
[null,"Arizona",512.4129083086367,42,1.4087135476271193E-2,42]
[null,"Arkansas",895.74561090644659,31,2.4754830361371622E-2,26]
{"$rows_left_out":57}
{"sheet":"12 Individual Income Tax - S&L","index":10,"n_rows":66,"n_cols":6,"rows_kept":66,"cut":false,"hidden":true,"merged":[]}
[]
[null,"Individual Income Tax - State and Local"]
[null,null,"FY",2012]
[]
[null,null,"Per Capita",null,"% of Income"]
[null,"State","Amount","Rank","Amount","Rank"]
[null,"Alabama",647.49467877358575,37,1.9E-2,37]
[null,"Alaska",0,0,0,0]
[null,"Arizona",472.1166344333555,42,1.2999999999999999E-2,41]
[null,"Arkansas",814.34236797503581,32,2.4E-2,23]
{"$rows_left_out":57}
{"sheet":"11 Individual Income Tax - S&L","index":11,"n_rows":66,"n_cols":6,"rows_kept":66,"cut":false,"hidden":true,"merged":[]}
[]
[null,"Individual Income Tax - State and Local"]
[null,null,"FY",2011]
[]
[null,null,"Per Capita",null,"% of Income"]
[null,"State","Amount","Rank","Amount","Rank"]
[null,"Alabama",604.75,38,1.7999999999999999E-2,36]
[null,"Alaska",0,0,0,0]
[null,"Arizona",442.79,42,1.2999999999999999E-2,42]
[null,"Arkansas",772.61,32,2.4E-2,22]
{"$rows_left_out":57}
{"sheet":"10 Individual Income Tax - S&L","index":12,"n_rows":66,"n_cols":6,"rows_kept":66,"cut":false,"hidden":true,"merged":[]}
[]
[null,"Individual Income Tax - State and Local"]
[null,null,"FY",2010]
[]
[null,null,"Per Capita",null,"% of Income"]
[null,"State","Amount","Rank","Amount","Rank"]
[null,"Alabama",563.67999999999995,37,1.7000000000000001E-2,36]
[null,"Alaska",0,0,0,0]
[null,"Arizona",376.91,42,1.0999999999999999E-2,42]
[null,"Arkansas",715.45,31,2.3E-2,24]
{"$rows_left_out":57}
{"sheet":"09 Individual Income Tax - S&L","index":13,"n_rows":66,"n_cols":6,"rows_kept":66,"cut":false,"hidden":true,"merged":[]}
[]
[null,"Individual Income Tax - State and Local"]
[null,null,"FY",2009]
[]
[null,null,"Per Capita",null,"% of Income"]
[null,"State","Amount","Rank","Amount","Rank"]
[null,"Alabama",593.73,38,1.7999999999999999E-2,36]
[null,"Alaska",0,0,0,0]
[null,"Arizona",390.52,42,1.0999999999999999E-2,42]
[null,"Arkansas",774.87,31,2.4E-2,22]
{"$rows_left_out":57}
{"sheet":"08 Individual Income Tax - S&L","index":14,"n_rows":66,"n_cols":6,"rows_kept":66,"cut":false,"hidden":true,"merged":[]}
[]
[null,"Individual Income Tax - State and Local"]
[null,null,"FY",2008]
[]
[null,null,"Per Capita",null,"% of Income"]
[null,"State","Amount","Rank","Amount","Rank"]
[null,"Alabama",681.6,38,2.1000000000000001E-2,36]
[null,"Alaska",0,0,0,0]
[null,"Arizona",524.45000000000005,41,1.4999999999999999E-2,41]
[null,"Arkansas",817.67,32,2.5999999999999999E-2,27]
{"$rows_left_out":57}
{"sheet":"07 Individual Income Tax - S&L","index":15,"n_rows":66,"n_cols":6,"rows_kept":66,"cut":false,"hidden":true,"merged":[]}
[]
[null,"Individual Income Tax - State and Local"]
[null,null,"FY",2007]
[]
[null,null,"Per Capita",null,"% of Income"]
[null,"State","Amount","Rank","Amount","Rank"]
[null,"Alabama",679.12,38,2.1999999999999999E-2,36]
[null,"Alaska",0,0,0,0]
[null,"Arizona",589,40,1.7999999999999999E-2,40]
[null,"Arkansas",762.95,32,2.5999999999999999E-2,28]
{"$rows_left_out":57}
{"sheet":"06 Individual Income Tax - S&L","index":16,"n_rows":66,"n_cols":6,"rows_kept":66,"cut":false,"hidden":true,"merged":[]}
[]
[null,"Individual Income Tax - State and Local"]
[null,null,"FY",2006]
[]
[null,null,"Per Capita",null,"% of Income"]
[null,"State","Amount","Rank","Amount","Rank"]
[null,"Alabama",625.63,37,2.1000000000000001E-2,35]
[null,"Alaska",0,0,0,0]
[null,"Arizona",525.39,40,1.7000000000000001E-2,40]
[null,"Arkansas",715.01,33,2.5999999999999999E-2,27]
{"$rows_left_out":57}
{"sheet":"05 Individual Income Tax - S&L","index":17,"n_rows":66,"n_cols":6,"rows_kept":66,"cut":false,"hidden":true,"merged":[]}
[]
[null,"Individual Income Tax - State and Local"]
[null,null,"FY",2005]
[]
[null,null,"Per Capita",null,"% of Income"]
[null,"State","Amount","Rank","Amount","Rank"]
[null,"Alabama",581.89,37,0.02,37]
[null,"Alaska",0,0,0,0]
[null,"Arizona",476.74,40,1.7000000000000001E-2,40]
[null,"Arkansas",675.4,32,2.5000000000000001E-2,24]
{"$rows_left_out":57}
{"sheet":"04 Individual Income Tax - S&L","index":18,"n_rows":66,"n_cols":6,"rows_kept":66,"cut":false,"hidden":true,"merged":[]}
[]
[null,"Individual Income Tax - State and Local"]
[null,null,"FY",2004]
[]
[null,null,"Per Capita",null,"% of Income"]
[null,"State","Amount","Rank","Amount","Rank"]
[null,"Alabama",519.54,38,1.9E-2,37]
[null,"Alaska",0,0,0,0]
[null,"Arizona",402.1,40,1.4999999999999999E-2,41]
[null,"Arkansas",614.73,33,2.4E-2,23]
{"$rows_left_out":56}